{"text_format":"1","workbook":"xlsx","n_sheets":3,"sheets":["Eingabe","Ausgabe","Hilfe"],"not_rendered":{"charts":1,"images":1,"macros":1,"external_links":0,"defined_names":0,"comments":0,"pivot_tables":0},"unopened":[],"bounds":{"document_bytes":16777216,"sheet_cells":100000,"rows_first":2000,"rows_last":500,"rows_between":2000,"halvings":0,"cell_chars":16384,"cell_head_chars":4096},"cells_cut":0,"cells_raw":0,"read":"whole","date_system":"1900"}

{"sheet":"Eingabe","index":0,"n_rows":36,"n_cols":7,"rows_kept":36,"cut":false,"hidden":false,"merged":[[35,0,35,6],[34,0,34,6],[33,5,33,6],[27,5,27,7],[27,0,27,1],[27,2,27,3],[18,0,18,1],[18,2,18,3],[26,4,26,5],[26,6,26,7],[23,1,23,6],[21,0,21,7],[25,0,25,1],[25,2,25,3],[26,0,26,1],[26,2,26,3],[3,0,3,7],[7,4,7,5],[7,0,7,1],[12,0,12,1],[13,0,13,1],[7,2,7,3],[13,2,13,3],[13,4,13,7],[5,0,5,7],[11,0,11,1],[11,2,11,3],[12,2,12,3],[9,0,9,1],[9,2,9,3],[14,2,14,3],[17,0,17,1],[17,2,17,3],[8,4,8,5],[8,6,8,7],[9,4,9,5],[9,6,9,7],[16,4,16,7],[15,0,15,7],[10,0,10,1],[10,2,10,3],[17,4,17,11],[16,2,16,3],[16,0,16,1]]}
[]
[]
[]
[{"$f":"IF(Hilfe!B1=YEAR(TODAY()),\"Annuität versus Tilgungsaussetzung\",\"Version ist ungültig!\")","v":"Annuität versus Tilgungsaussetzung"}]
[]
["Eingaben"]
[]
["Gesamt-Bruttoeinkommen p. a.",null,30000,null,"Familienstand"]
[null,null,null,null,"Alter",null,22]
["Darlehen",null,230000,null,"Alter Darlehensende",null,{"$f":"G9+Hilfe!B11","v":47}]
["Zins Darlehen p. a. Annuität",null,1.4999999999999999E-2]
["Zins Darlehen p. a. T-Aussetzung",null,0.02]
["Dauer Darlehen (für die Optimierung)",null,25]
["Zahlrate mtl. (Zins / Tilgung)",null,906.58333333333337,null,{"$f":"IF(Hilfe!K5<0,\"     ACHTUNG: Rate ist zu niedrig!\",\"Anfangstilgung: \"&FIXED(Hilfe!K5,2)&\" EUR.\")","v":"Anfangstilgung: 619,08 EUR."}]
[null,"Anfangstilgungsrate",{"$f":"Hilfe!B13","v":3.2300000000000002E-2}]
[{"$f":"IF(Hilfe!B11=66,\"Planmäßiges Darlehensende wird nicht errechnet, liegt aber nach 66 Jahren Darlehensdauer.\",\"Planmäßiges Darlehensende nach \"&Hilfe!B11&\" Jahren und \"&Hilfe!B10&\" Monaten.\")","v":"Planmäßiges Darlehensende nach 25 Jahren und 5 Monaten."}]
["Wertentwicklung Fondspolice ",null,0.04,null,"gemäß unverbindlicher Hochrechnung im Vorschlag"]
["Ablaufleistung Fondspolice",null,272768,null,{"$f":"\"(Beitrag mtl. \"&FIXED(Hilfe!K5,2)&\" EUR, \"&Hilfe!B12&\" Jahre, nur ganzjährige Laufzeiten)\"","v":"(Beitrag mtl. 619,08 EUR, 25 Jahre, nur ganzjährige Laufzeiten)"}]
["Tarif Fondspolice"]
[]
[]
["Hilfsrechner"]
[]
[null,"Sparen auf Eigenkapital"]
[]
["Sparrate vor Darlehensaufnahme",null,100]
["Guthabenzins",null,0.06,null,"Guthaben",null,{"$f":"FV(C27/12,C28*12,-C26)","v":16387.934680645605}]
["Zeit bis zur Darlehensaufnahme",null,10,null,null,"(Reduziert die Darlehenssumme)"]
[]
[]
[]
[]
[]
[null,null,null,null,null,{"$f":"\"Stand: 1/\"&Hilfe!B1&\"\"","v":"Stand: 1/2022"}]
["Quelle: Eigene Berechnungen auf Basis Ihrer Angaben und der gesetzlichen / steuerrechtlichen  Daten."]
["Für die Richtigkeit der Angaben kann keine Gewähr übernommen werden, denn Programm- und Berechnungsfehler sind trotz sorgfältigstem Vorgehen nicht ausgeschlossen.           "]

{"sheet":"Ausgabe","index":1,"n_rows":69,"n_cols":8,"rows_kept":69,"cut":false,"hidden":false,"merged":[[57,0,57,7],[37,1,37,3],[37,4,37,6],[31,1,31,3],[31,4,31,6],[56,4,56,6],[53,1,53,3],[54,1,54,3],[55,1,55,3],[56,1,56,3],[53,4,53,6],[54,4,54,6],[55,4,55,6],[52,0,52,7],[35,0,35,1],[35,5,35,6],[66,5,66,6],[67,0,67,6],[68,0,68,6],[6,1,6,3],[7,1,7,3],[9,1,9,3],[27,4,27,6],[23,4,23,6],[22,5,22,6],[16,0,16,7],[18,0,18,7],[15,0,15,7],[12,4,12,5],[12,0,12,3],[36,0,36,1],[36,5,36,6],[1,0,1,7],[4,0,4,7],[11,1,11,3],[10,1,10,3],[6,4,6,5],[7,4,7,5],[9,4,9,5],[10,4,10,5],[11,4,11,5],[8,1,8,3],[8,4,8,5],[13,0,13,3],[30,0,30,1],[30,5,30,6],[33,0,33,7],[20,0,20,2],[20,5,20,7],[14,1,14,3],[13,4,13,5],[14,4,14,5],[23,0,23,1],[24,0,24,1],[27,0,27,1],[24,5,24,6],[28,4,29,7],[26,3,26,6],[64,0,64,7],[59,0,59,7],[60,0,60,7],[61,0,61,7],[63,0,63,7],[62,0,62,7]]}
[]
["Persönliche Übersicht"]
[]
[]
["Ihre Vorgaben"]
[]
[null,"Darlehenswunsch",null,null,{"$f":"Eingabe!C10","v":230000}]
[null,"Zins p. a. Annuität",null,null,{"$f":"Eingabe!C11","v":1.4999999999999999E-2}]
[null,"Zins p. a. Tilgungsaussetzung",null,null,{"$f":"Eingabe!C12","v":0.02}]
[null,"Anfangstilgung p. a.",null,null,{"$f":"Eingabe!C15","v":3.2300000000000002E-2}]
[null,"Gesamtrate",null,null,{"$f":"Eingabe!C14","v":906.58333333333337}]
[null,"Anfangstilgung p. a.",null,null,{"$f":"Hilfe!K5","v":619.08333333333337}]
[{"$f":"\"Beitrag \"&Hilfe!B28&\"\"","v":"Beitrag CleVesto Select"},null,null,null,{"$f":"Hilfe!K5","v":619.08333333333337}]
[{"$f":"\"mögliche Ablaufleistung Fondspolice (\"&Eingabe!C17*100&\"% p. a.)\"","v":"mögliche Ablaufleistung Fondspolice (4% p. a.)"},null,null,null,{"$f":"Eingabe!C18","v":272768}]
[null,"Einkommen",null,null,{"$f":"Eingabe!C8","v":30000}]
[{"$f":"Eingabe!A16","v":"Planmäßiges Darlehensende nach 25 Jahren und 5 Monaten."}]
[{"$f":"\"Tilgungsaussetzung endet nach \"&Hilfe!B12&\" Jahren mit der Auszahlung der Fondspolice.\"","v":"Tilgungsaussetzung endet nach 25 Jahren mit der Auszahlung der Fondspolice."}]
[]
["Vergleich Annuität und Tilgungsaussetzung"]
[]
["Annuität",null,null,null,null,"Tilgungsaussetzung"]
[]
["Gesamtaufwand",null,{"$f":"C24+C25","v":277414.49999999983},null,null,"Gesamtaufwand",null,{"$f":"H24+H25","v":300725}]
["davon Tilgungsraten ",null,{"$f":"Hilfe!K3","v":230593.56257307262},null,"davon Beitrag Fondspolice",null,null,{"$f":"Hilfe!P3","v":185725}]
["davon Zinsaufwand ",null,{"$f":"Hilfe!I3","v":46820.937426927216},null,null,"davon Zinsaufwand",null,{"$f":"Hilfe!S3","v":115000}]
[]
[null,null,null,"Auszahlung Fondspolice nach Steuer",null,null,null,{"$f":"E14-Hilfe!B24","v":254271.36249999999}]
["Restdarlehen",null,{"$f":"Hilfe!M796","v":0},null,"Guthaben (+) / Restdarlehen (-)",null,null,{"$f":"H27-E7","v":24271.362499999988}]
[null,null,null,null,{"$f":"\"(Die Steuer der Zinserträge wurde mit \"&Hilfe!A23&\" berechnet.)\"","v":"(Die Steuer der Zinserträge wurde mit Abgeltungsteuer ohne Kirchensteuer und Soli berechnet.)"}]
[]
["Gesamtaufwand",null,{"$f":"C24+C25","v":277414.49999999983},null,null,"Gesamtaufwand",null,{"$f":"H23-H28","v":276453.63750000001}]
[null,"Vorteil (+) / Nachteil (-)",null,null,{"$f":"C31-H31","v":960.86249999981374}]
[]
["Bei einer fremdgenutzten Immobilie"]
[]
["Steuereffekt (Zins)",null,{"$f":"Hilfe!T3","v":13907.181279203412},null,null,"Steuereffekt (Zins)",null,{"$f":"Hilfe!U3","v":33630.457554604887}]
["Netto-Gesamtaufwand",null,{"$f":"C23-C36","v":263507.31872079644},null,null,"Netto-Gesamtaufwand",null,{"$f":"H23-H36-H28","v":242823.17994539515}]
[null,"Vorteil (+) / Nachteil (-)",null,null,{"$f":"C37-H37","v":20684.138775401283}]
[]
[]
[]
[]
[]
[]
[]
[]
[]
[]
[]
[]
[]
[]
[{"$f":"\"Um die angegebene Rendite in Höhe von \"&FIXED(Eingabe!C17*100,2)&\"% p. a. innerhalb der Fondspolice \"&Hilfe!B28&\" besser einsortieren zu können, sind hier die Renditen angegeben, die der deutsche Performanceindex DAX über \"&Hilfe!B12&\" Jahres-Zeiträumen in der Vergangenheit erzielt hat:\"","v":"Um die angegebene Rendite in Höhe von 4,00% p. a. innerhalb der Fondspolice CleVesto Select besser einsortieren zu können, sind hier die Renditen angegeben, die der deutsche Performanceindex DAX über 25 Jahres-Zeiträumen in der Vergangenheit erzielt hat:"}]
[null,"schlechteste Rendite",null,null,{"$f":"Hilfe!X3","v":1.8632204017882167E-2}]
[null,"Mittelwert",null,null,{"$f":"Hilfe!Y3","v":6.8379581497945263E-2}]
[null,"beste Rendite",null,null,{"$f":"Hilfe!Z3","v":0.10890217461790995}]
[null,"Anzahl der berechneten Perioden",null,null,{"$f":"Hilfe!AA3","v":446}]
["Bitte beachten Sie, dass Renditen aus der Vergangenheit keine Gewähr für die Zukunft geben können."]
[]
["Bei einer fremdgenutzten Immobilie können die Darlehenszinsen in der Steuererklärung geltend gemacht werden und wirken sich somit steuermindernd aus. Es könnte deshalb vorteilhaft sein, die Tilgung auszusetzen, um von einer gleichbleibenden Steuerentlastung zu profitieren."]
[{"$f":"\"Eine Alternative zur laufenden Tilgung des Darlehens ist eine so genannte Finanzierung mit Tilgungsaussetzung. Die Zinsen bleiben konstant, da die Tilgungsrate in eine Fondspolice \"&Hilfe!B28&\" investiert wird. Die Erträge daraus müssen ab einer Laufzeit von 12 Jahren und einem Mindestalter bei Verfügung von 62 Jahren (Stand \"&Hilfe!B1&\") nur zur Hälfte mit dem persönlichen Steuersatz versteuert werden.\"","v":"Eine Alternative zur laufenden Tilgung des Darlehens ist eine so genannte Finanzierung mit Tilgungsaussetzung. Die Zinsen bleiben konstant, da die Tilgungsrate in eine Fondspolice CleVesto Select investiert wird. Die Erträge daraus müssen ab einer Laufzeit von 12 Jahren und einem Mindestalter bei Verfügung von 62 Jahren (Stand 2022) nur zur Hälfte mit dem persönlichen Steuersatz versteuert werden."}]
["Ein zusätzlicher Renditeeffekt kann sich bei der Tilgungsaussetzung einstellen, wenn die Rendite der Police höher als der Darlehenszins ist. Bei guter Wertentwicklung ist dadurch eine vorzeitige Tilgung oder ein Überschuss möglich.\n\nBitte beachten Sie dabei: Die Wertentwicklung der Fondsanlage ist nicht garantiert und kann auch negativ sein! Somit kann die Ablaufleistung der Fondspolice (nach Steuer) größer oder auch kleiner als der Darlehensbetrag sein!"]
[]
["Bitte beachten: Diese Informationen sind keine Informationen nach dem Versicherungsvertragsgesetz (VVG), der VVG Informationspflichtenverordnung (VVG-InfoV), dem Altersvorsorgeverträge-Zertifizierungsgesetz (AltZertG) und der Altersvorsorge-Produktinformationsblattverordnung (AltvPIBV)."]
["Ziehen Sie für die Steuerbetrachtung immer Ihren Steuerberater mit hinzu."]
[]
[null,null,null,null,null,{"$f":"\"Stand: 1/\"&Hilfe!B1&\"\"","v":"Stand: 1/2022"}]
["Quelle: Eigene Berechnungen auf Basis Ihrer Angaben und der gesetzlichen / steuerrechtlichen  Daten."]
["Für die Richtigkeit der Angaben kann keine Gewähr übernommen werden, denn Programm- und Berechnungsfehler sind trotz sorgfältigstem Vorgehen nicht ausgeschlossen.           "]

{"sheet":"Hilfe","index":2,"n_rows":797,"n_cols":27,"rows_kept":797,"cut":false,"hidden":true,"merged":[[1,3,1,12],[1,15,1,24]]}
["Jahr",2022]
["Gehalt",{"$f":"Eingabe!C8","v":30000},null,"Annuität",null,null,null,null,null,null,null,null,null,null,null,"Vergleich"]
["nicht verheiratet",1,null,null,null,null,null,null,{"$f":"SUM(I5:I796)","v":46820.937426927216},{"$f":"SUM(J5:J796)","v":277414.50000000081},{"$f":"SUM(K5:K796)","v":230593.56257307262},null,null,null,null,{"$f":"SUM(P5:P69)-P5","v":185725},null,{"$f":"SUM(R5:R69)","v":46820.937426927274},{"$f":"SUM(S5:S69)-S5","v":115000},{"$f":"SUM(T5:T69)","v":13907.181279203412},{"$f":"SUM(U5:U69)-U5","v":33630.457554604887},null,{"$f":"B12","v":25},{"$f":"VLOOKUP(W3,W5:AA56,2)","v":1.8632204017882167E-2},{"$f":"VLOOKUP(W3,W5:AA56,3)","v":6.8379581497945263E-2},{"$f":"VLOOKUP(W3,W5:AA56,4)","v":0.10890217461790995},{"$f":"VLOOKUP(W3,W5:AA56,5)","v":446}]
["verheiratet",null,null,"Ende","Für sverweis","Jahre","Monate","Restschuld","Zins","Rate","Tilgung","Rate","Gesamt","Zins pro Jahr",null,"Beitrag","Jahr","Zins Annuität","Zins Tilgungsaussetzung","Steuereffekt Annuität","Steuereffekt Tilgungsaussetzung",null,"Laufzeit","Min","Mittel",0.04,"Perioden"]
[null,null,null,{"$f":"IF(AND(M5=0,M4>0),1,0)","v":0},{"$f":"IF(G5=12,1+E4,0)","v":0},0,1,{"$f":"Eingabe!C10","v":230000},{"$f":"H5*Eingabe!$C$11/12","v":287.5},{"$f":"Eingabe!C14","v":906.58333333333337},{"$f":"J5-I5","v":619.08333333333337},{"$f":"I5+K5","v":906.58333333333337},{"$f":"H5-K5","v":229380.91666666666},{"$f":"IF(G5=1,I5,I5+I4)","v":287.5},null,{"$f":"IF(R5>0,Ausgabe!$E$13*12,0)","v":7429},1,{"$f":"VLOOKUP(Q5,E4:N796,10,FALSE)","v":3398.7122153775317},{"$f":"IF(R5>0,$H$5*Eingabe!$C$12,0)","v":4600},{"$f":"steuer($B$3,$B$2)-steuer($B$3,$B$2-R5)","v":1002.3428027328182},{"$f":"steuer($B$3,$B$2)-steuer($B$3,$B$2-S5)","v":1345.2183021841952},null,10,1.0260773259973254E-2,5.7546327638632384E-2,0.13571524217591752,626]
["Eigengenutzt",1,null,0,{"$f":"IF(G6=12,1+E5,E5)","v":0},0,2,{"$f":"M5","v":229380.91666666666},{"$f":"H6*Eingabe!$C$11/12","v":286.72614583333331},{"$f":"IF(H6=0,0,J5)","v":906.58333333333337},{"$f":"J6-I6","v":619.85718750000001},{"$f":"I6+K6","v":906.58333333333326},{"$f":"IF(H6-K6<=0,0,H6-K6)","v":228761.05947916667},{"$f":"IF(G6=1,I6,I6+N5)","v":574.22614583333325},null,{"$f":"IF(R6>0,Ausgabe!$E$13*12,0)","v":7429},2,3285.7332706862435,{"$f":"IF(R6>0,$H$5*Eingabe!$C$12,0)","v":4600},969.78904284527744,1345.2183021841952,null,11,9.0045326546746886E-3,5.7348313224677185E-2,0.13089584718938421,614]
["Fremdgenutzt",{"$f":"IF(B6=1,A6,A7)","v":"Eigengenutzt"},null,0,{"$f":"IF(G7=12,1+E6,E6)","v":0},0,3,{"$f":"M6","v":228761.05947916667},{"$f":"H7*Eingabe!$C$11/12","v":285.95132434895834},906.58333333333337,{"$f":"J7-I7","v":620.63200898437503},{"$f":"I7+K7","v":906.58333333333337},228140.4274701823,860.17747018229159,null,{"$f":"IF(R7>0,Ausgabe!$E$13*12,0)","v":7429},3,3171.0479421884656,{"$f":"IF(R7>0,$H$5*Eingabe!$C$12,0)","v":4600},936.69192277934326,1345.2183021841952,null,12,1.0661566447326017E-2,5.7439106935899882E-2,0.12464875304130613,602]
[null,null,null,0,0,0,4,228140.4274701823,{"$f":"H8*Eingabe!$C$11/12","v":285.17553433772787},906.58333333333337,621.4077989956055,906.58333333333337,227519.01967118669,1145.3530045200196,null,{"$f":"IF(R8>0,Ausgabe!$E$13*12,0)","v":7429},4,3054.6304574209935,{"$f":"IF(R8>0,$H$5*Eingabe!$C$12,0)","v":4600},903.03695816376603,1345.2183021841952,null,13,1.1417348913176945E-2,5.7610690758724777E-2,0.1230823515214331,590]
[null,null,null,0,0,0,5,227519.01967118669,{"$f":"H9*Eingabe!$C$11/12","v":284.39877458898337},906.58333333333337,622.18455874434994,906.58333333333326,226896.83511244235,1429.7517791090029,null,{"$f":"IF(R9>0,Ausgabe!$E$13*12,0)","v":7429},5,2936.4546546647834,{"$f":"IF(R9>0,$H$5*Eingabe!$C$12,0)","v":4600},868.81576615587437,1345.2183021841952,null,14,1.0122697426292451E-2,5.7855661102952025E-2,0.12098401277418216,578]
["Monat",{"$f":"VLOOKUP(1,D:G,4,FALSE)-1","v":5},null,0,0,0,6,226896.83511244235,{"$f":"H10*Eingabe!$C$11/12","v":283.62104389055293},906.58333333333337,622.9622894427805,906.58333333333348,226273.87282299958,1713.3728229995559,null,{"$f":"IF(R10>0,Ausgabe!$E$13*12,0)","v":7429},6,2816.4939770658043,{"$f":"IF(R10>0,$H$5*Eingabe!$C$12,0)","v":4600},834.02023232844658,1345.2183021841952,null,15,9.0283536608991525E-3,5.8450681657287631E-2,0.11641458853265951,566]
["Jahr",{"$f":"VLOOKUP(1,D:G,3,FALSE)","v":25},null,0,0,0,7,226273.87282299958,{"$f":"H11*Eingabe!$C$11/12","v":282.84234102874944},906.58333333333337,623.74099230458387,906.58333333333326,225650.131830695,1996.2151640283053,null,{"$f":"IF(R11>0,Ausgabe!$E$13*12,0)","v":7429},7,2694.7214666670961,{"$f":"IF(R11>0,$H$5*Eingabe!$C$12,0)","v":4600},798.63904547010407,1345.2183021841952,null,16,1.0302497511491223E-2,5.9304482811784395E-2,0.11232857916721893,554]
["Fondspolicen Jahre",{"$f":"IF(B10=0,B11,B11)","v":25},null,0,0,0,8,225650.131830695,{"$f":"H12*Eingabe!$C$11/12","v":282.06266478836875},906.58333333333337,624.52066854496456,906.58333333333326,225025.61116215005,2278.2778288166742,null,{"$f":"IF(R12>0,Ausgabe!$E$13*12,0)","v":7429},8,2571.1097583506921,{"$f":"IF(R12>0,$H$5*Eingabe!$C$12,0)","v":4600},762.66079432087372,1345.2183021841952,null,17,1.181881560338096E-2,6.0162318682374857E-2,0.11258098667728098,542]
["Tilgungsrate",{"$f":"K5*12/H5","v":3.2300000000000002E-2},null,0,0,0,9,225025.61116215005,{"$f":"H13*Eingabe!$C$11/12","v":281.28201395268758},906.58333333333337,625.30131938064574,906.58333333333326,224400.30984276941,2559.5598427693617,null,{"$f":"IF(R13>0,Ausgabe!$E$13*12,0)","v":7429},9,2445.6310736880323,{"$f":"IF(R13>0,$H$5*Eingabe!$C$12,0)","v":4600},726.07326953250686,1345.2183021841952,null,18,1.1033498860095725E-2,6.1030989239705936E-2,0.11255495315676046,530]
[null,null,null,0,0,0,10,224400.30984276941,{"$f":"H14*Eingabe!$C$11/12","v":280.50038730346176},906.58333333333337,626.08294602987166,906.58333333333348,223774.22689673954,2840.0602300728233,null,{"$f":"IF(R14>0,Ausgabe!$E$13*12,0)","v":7429},10,2318.2572146975099,{"$f":"IF(R14>0,$H$5*Eingabe!$C$12,0)","v":4600},688.86868298226,1345.2183021841952,null,19,1.1282003636983069E-2,6.1908582687005914E-2,0.11467162427412292,518]
["Berechnung Ablauf nach Steuer",null,null,0,0,0,11,223774.22689673954,{"$f":"H15*Eingabe!$C$11/12","v":279.71778362092442},906.58333333333337,626.86554971240889,906.58333333333326,223147.36134702712,3119.7780136937477,null,{"$f":"IF(R15>0,Ausgabe!$E$13*12,0)","v":7429},11,2188.9595575077269,{"$f":"IF(R15>0,$H$5*Eingabe!$C$12,0)","v":4600},651.03148600643453,1345.2183021841952,null,20,1.1716713955294394E-2,6.2731605274596008E-2,0.11549003480719308,506]
["Ablaufleistung",{"$f":"Eingabe!C18","v":272768},null,0,1,0,12,223147.36134702712,{"$f":"H16*Eingabe!$C$11/12","v":278.9342016837839},906.58333333333337,627.64913164954942,906.58333333333326,222519.71221537757,3398.7122153775317,null,{"$f":"IF(R16>0,Ausgabe!$E$13*12,0)","v":7429},12,2057.7090459250439,{"$f":"IF(R16>0,$H$5*Eingabe!$C$12,0)","v":4600},612.55333872747178,1345.2183021841952,null,21,1.1964196472696425E-2,6.3621138764988136E-2,0.11572650549583886,494]
["Beitragssumme",{"$f":"P3","v":185725},null,0,1,1,1,222519.71221537757,{"$f":"H17*Eingabe!$C$11/12","v":278.14964026922195},906.58333333333337,628.43369306411137,906.58333333333326,221891.27852231346,278.14964026922195,null,{"$f":"IF(R17>0,Ausgabe!$E$13*12,0)","v":7429},13,1924.4761849039758,{"$f":"IF(R17>0,$H$5*Eingabe!$C$12,0)","v":4600},573.42161019655578,1345.2183021841952,null,22,1.1092807331060882E-2,6.4675575243752392E-2,0.11489311338332596,482]
["Ertrag",{"$f":"MAX(B16-B17,0)","v":87043},null,0,1,1,2,221891.27852231346,{"$f":"H18*Eingabe!$C$11/12","v":277.36409815289181},906.58333333333337,629.2192351804415,906.58333333333326,221262.05928713302,555.51373842211376,null,{"$f":"IF(R18>0,Ausgabe!$E$13*12,0)","v":7429},14,1789.2310339189701,{"$f":"IF(R18>0,$H$5*Eingabe!$C$12,0)","v":4600},533.62179491071493,1345.2183021841952,null,23,1.0644747975614897E-2,6.5870349499043065E-2,0.11293478601211858,470]
["Teilfreistellung 15%",{"$f":"B18*0.15","v":13056.449999999999},null,0,1,1,3,221262.05928713302,{"$f":"H19*Eingabe!$C$11/12","v":276.57757410891628},906.58333333333337,630.00575922441703,906.58333333333326,220632.0535279086,832.0913125310301,null,{"$f":"IF(R19>0,Ausgabe!$E$13*12,0)","v":7429},15,1651.9432002360729,{"$f":"IF(R19>0,$H$5*Eingabe!$C$12,0)","v":4600},493.14452933956818,1345.2183021841952,null,24,1.4042962889079818E-2,6.7144346791710455E-2,0.1108562459108334,458]
["zu versteuern",{"$f":"B18-B19","v":73986.55},null,0,1,1,4,220632.0535279086,{"$f":"H20*Eingabe!$C$11/12","v":275.79006690988575},906.58333333333337,630.79326642344768,906.58333333333348,220001.26026148515,1107.8813794409159,null,{"$f":"IF(R20>0,Ausgabe!$E$13*12,0)","v":7429},16,1512.5818320829735,{"$f":"IF(R20>0,$H$5*Eingabe!$C$12,0)","v":4600},451.97718041106691,1345.2183021841952,null,25,1.8632204017882167E-2,6.8379581497945263E-2,0.10890217461790995,446]
["Steuer bei HEV ohne Kiche / Soli",{"$f":"steuer(B3,B2+B20/2)-steuer(B3,B2)","v":13849.103941625057},null,0,1,1,5,220001.26026148515,{"$f":"H21*Eingabe!$C$11/12","v":275.00157532685643},906.58333333333337,631.581758006477,906.58333333333348,219369.67850347867,1382.8829547677724,null,{"$f":"IF(R21>0,Ausgabe!$E$13*12,0)","v":7429},17,1371.1156117158941,{"$f":"IF(R21>0,$H$5*Eingabe!$C$12,0)","v":4600},410.10769751246607,1345.2183021841952,null,26,2.6691187303115649E-2,6.9501543101361793E-2,0.10679558563059101,434]
["Abgeltungsteuer ohne Soli/Kirche",{"$f":"B20*0.25","v":18496.637500000001},null,0,1,1,6,219369.67850347867,{"$f":"H22*Eingabe!$C$11/12","v":274.21209812934836},906.58333333333337,632.37123520398495,906.58333333333326,218737.30726827469,1657.0950528971207,null,{"$f":"IF(R22>0,Ausgabe!$E$13*12,0)","v":7429},18,1227.5127483817628,{"$f":"IF(R22>0,$H$5*Eingabe!$C$12,0)","v":4600},367.51718514475306,1345.2183021841952,null,27,3.9263158053349484E-2,7.0320001405672405E-2,0.10509812077396401,422]
[{"$f":"IF(AND(B11>12,Eingabe!G9+Hilfe!B11>=62),\"Halbeinkünfteverfahren ohne Kirchensteuer und Soli\",\"Abgeltungsteuer ohne Kirchensteuer und Soli\")","v":"Abgeltungsteuer ohne Kirchensteuer und Soli"},null,null,0,1,1,7,218737.30726827469,{"$f":"H23*Eingabe!$C$11/12","v":273.42163408534333},906.58333333333337,633.1616992479901,906.58333333333348,218104.1455690267,1930.5166869824641,null,{"$f":"IF(R23>0,Ausgabe!$E$13*12,0)","v":7429},19,1081.7409711740911,{"$f":"IF(R23>0,$H$5*Eingabe!$C$12,0)","v":4600},324.19933582074464,1345.2183021841952,null,28,4.7098126387715725E-2,7.0869759788648387E-2,0.10365544172157032,410]
["Steuer effektiv",{"$f":"IF(AND(B11>12,Eingabe!G9+Hilfe!B11>=62),Hilfe!B21,Hilfe!B22)","v":18496.637500000001},null,0,1,1,8,218104.1455690267,{"$f":"H24*Eingabe!$C$11/12","v":272.63018196128337},906.58333333333337,633.95315137205,906.58333333333337,217470.19241765465,2203.1468689437474,null,{"$f":"IF(R24>0,Ausgabe!$E$13*12,0)","v":7429},20,933.76752178095217,{"$f":"IF(R24>0,$H$5*Eingabe!$C$12,0)","v":4600},280.13745957873925,1345.2183021841952,null,29,4.83484802683527E-2,7.1302389997794507E-2,0.10195611012365842,398]
[null,null,null,0,1,1,9,217470.19241765465,{"$f":"H25*Eingabe!$C$11/12","v":271.83774052206826},906.58333333333337,634.74559281126517,906.58333333333348,216835.44682484338,2474.9846094658155,null,{"$f":"IF(R25>0,Ausgabe!$E$13*12,0)","v":7429},21,783.55914712342246,{"$f":"IF(R25>0,$H$5*Eingabe!$C$12,0)","v":4600},235.31648270227743,1345.2183021841952,null,30,5.1566589583357636E-2,7.166459794169143E-2,9.958851867898813E-2,386]
["CleVesto Allcase",2,null,0,1,1,10,216835.44682484338,{"$f":"H26*Eingabe!$C$11/12","v":271.04430853105424},906.58333333333337,635.53902480227907,906.58333333333326,216199.90780004111,2746.02891799687,null,{"$f":"IF(R26>0,Ausgabe!$E$13*12,0)","v":7429},22,631.08209188284218,{"$f":"IF(R26>0,$H$5*Eingabe!$C$12,0)","v":4600},189.7229625437858,1345.2183021841952,null,31,5.4414268052191295E-2,7.191128550796988E-2,9.7562800715693176E-2,374]
["CleVesto Select",null,null,0,1,1,11,216199.90780004111,{"$f":"H27*Eingabe!$C$11/12","v":270.24988475005136},906.58333333333337,636.33344858328201,906.58333333333337,215563.57435145782,3016.2788027469214,null,{"$f":"IF(R27>0,Ausgabe!$E$13*12,0)","v":7429},23,476.30209091520987,{"$f":"IF(R27>0,$H$5*Eingabe!$C$12,0)","v":4600},143.34331517695136,1345.2183021841952,null,32,5.3152715032958264E-2,7.2156981275258714E-2,9.5589400769788502E-2,362]
["CleVesto Favorites",{"$f":"IF(B26=1,A26,IF(B26=2,A27,A28))","v":"CleVesto Select"},null,0,2,1,12,215563.57435145782,{"$f":"H28*Eingabe!$C$11/12","v":269.45446793932223},906.58333333333337,637.1288653940112,906.58333333333348,214926.44548606381,3285.7332706862435,null,{"$f":"IF(R28>0,Ausgabe!$E$13*12,0)","v":7429},24,319.18436155100613,{"$f":"IF(R28>0,$H$5*Eingabe!$C$12,0)","v":4600},96.161303930946815,1345.2183021841952,null,33,5.2330881361393196E-2,7.2465360057682726E-2,9.3262528463848401E-2,350]
[null,null,null,0,2,2,1,214926.44548606381,{"$f":"H29*Eingabe!$C$11/12","v":268.65805685757977},906.58333333333337,637.92527647575366,906.58333333333348,214288.52020958805,268.65805685757977,null,{"$f":"IF(R29>0,Ausgabe!$E$13*12,0)","v":7429},25,159.69359577871788,{"$f":"IF(R29>0,$H$5*Eingabe!$C$12,0)","v":4600},48.163396174145419,1345.2183021841952,null,34,5.3494955272384695E-2,7.2790940866619622E-2,9.109330902655062E-2,338]
[null,null,null,0,2,2,2,214288.52020958805,{"$f":"H30*Eingabe!$C$11/12","v":267.86065026198509},906.58333333333337,638.72268307134823,906.58333333333326,213649.79752651669,536.51870711956485,null,{"$f":"IF(R30>0,Ausgabe!$E$13*12,0)","v":7429},26,19.286401241451848,{"$f":"IF(R30>0,$H$5*Eingabe!$C$12,0)","v":4600},5.8236837155182002,1345.2183021841952,null,35,5.4827428689146904E-2,7.3066702949998688E-2,8.9484330681309732E-2,326]
[null,null,null,0,2,2,3,213649.79752651669,{"$f":"H31*Eingabe!$C$11/12","v":267.06224690814582},906.58333333333337,639.5210864251876,906.58333333333348,213010.27644009149,803.58095402771073,null,{"$f":"IF(R31>0,Ausgabe!$E$13*12,0)","v":0},27,0,{"$f":"IF(R31>0,$H$5*Eingabe!$C$12,0)","v":0},0,0,null,36,5.4273989767256503E-2,7.3381331423619536E-2,8.8313922863288707E-2,314]
[null,null,null,0,2,2,4,213010.27644009149,{"$f":"H32*Eingabe!$C$11/12","v":266.26284555011438},906.58333333333337,640.32048778321905,906.58333333333348,212369.95595230826,1069.8437995778252,null,{"$f":"IF(R32>0,Ausgabe!$E$13*12,0)","v":0},28,0,{"$f":"IF(R32>0,$H$5*Eingabe!$C$12,0)","v":0},0,0,null,37,5.5948277416103795E-2,7.3712138423503423E-2,8.670591443713746E-2,302]
[null,null,null,0,2,2,5,212369.95595230826,{"$f":"H33*Eingabe!$C$11/12","v":265.4624449403853},906.58333333333337,641.12088839294802,906.58333333333326,211728.83506391532,1335.3062445182104,null,{"$f":"IF(R33>0,Ausgabe!$E$13*12,0)","v":0},29,0,{"$f":"IF(R33>0,$H$5*Eingabe!$C$12,0)","v":0},0,0,null,38,6.0496764289310653E-2,7.3935716510545951E-2,8.5000989947853281E-2,290]
[null,null,null,0,2,2,6,211728.83506391532,{"$f":"H34*Eingabe!$C$11/12","v":264.66104382989414},906.58333333333337,641.92228950343929,906.58333333333348,211086.91277441187,1599.9672883481046,null,{"$f":"IF(R34>0,Ausgabe!$E$13*12,0)","v":0},30,0,{"$f":"IF(R34>0,$H$5*Eingabe!$C$12,0)","v":0},0,0,null,39,6.6765989913457419E-2,7.3905247534053115E-2,8.3439763043030593E-2,278]
[null,null,null,0,2,2,7,211086.91277441187,{"$f":"H35*Eingabe!$C$11/12","v":263.85864096801487},906.58333333333337,642.72469236531856,906.58333333333348,210444.18808204654,1863.8259293161195,null,{"$f":"IF(R35>0,Ausgabe!$E$13*12,0)","v":0},31,0,{"$f":"IF(R35>0,$H$5*Eingabe!$C$12,0)","v":0},0,0,null,40,6.7480328504256767E-2,7.359318656533799E-2,8.2210257858372354E-2,266]
[null,null,null,0,2,2,8,210444.18808204654,{"$f":"H36*Eingabe!$C$11/12","v":263.05523510255819},906.58333333333337,643.52809823077519,906.58333333333337,209800.65998381577,2126.8811644186776,null,{"$f":"IF(R36>0,Ausgabe!$E$13*12,0)","v":0},32,0,{"$f":"IF(R36>0,$H$5*Eingabe!$C$12,0)","v":0},0,0,null,41,6.6801881070514602E-2,7.2990028312728994E-2,8.0618318819494078E-2,254]
[null,null,null,0,2,2,9,209800.65998381577,{"$f":"H37*Eingabe!$C$11/12","v":262.25082497976967},906.58333333333337,644.33250835356375,906.58333333333348,209156.3274754622,2389.1319893984473,null,{"$f":"IF(R37>0,Ausgabe!$E$13*12,0)","v":0},33,{"$f":"VLOOKUP(Q37,E36:N828,10,FALSE)","v":0},{"$f":"IF(R37>0,$H$5*Eingabe!$C$12,0)","v":0},{"$f":"steuer($B$3,$B$2)-steuer($B$3,$B$2-R37)","v":0},{"$f":"steuer($B$3,$B$2)-steuer($B$3,$B$2-S37)","v":0},null,42,6.5861228158215865E-2,7.2112611808989688E-2,7.8953096910396967E-2,242]
[null,null,null,0,2,2,10,209156.3274754622,{"$f":"H38*Eingabe!$C$11/12","v":261.44540934432774},906.58333333333337,645.13792398900569,906.58333333333348,208511.18955147319,2650.5773987427751,null,{"$f":"IF(R38>0,Ausgabe!$E$13*12,0)","v":0},34,0,{"$f":"IF(R38>0,$H$5*Eingabe!$C$12,0)","v":0},0,0,null,43,6.4923189416606367E-2,7.1134350828169282E-2,7.6911671183653316E-2,230]
[null,null,null,0,2,2,11,208511.18955147319,{"$f":"H39*Eingabe!$C$11/12","v":260.63898693934146},906.58333333333337,645.94434639399196,906.58333333333348,207865.24520507921,2911.2163856821167,null,{"$f":"IF(R39>0,Ausgabe!$E$13*12,0)","v":0},35,0,{"$f":"IF(R39>0,$H$5*Eingabe!$C$12,0)","v":0},0,0,null,44,6.4256432397956836E-2,7.0256714601657624E-2,7.5237888863715546E-2,218]
[null,null,null,0,3,2,12,207865.24520507921,{"$f":"H40*Eingabe!$C$11/12","v":259.83155650634899},906.58333333333337,646.75177682698438,906.58333333333337,207218.49342825223,3171.0479421884656,null,{"$f":"IF(R40>0,Ausgabe!$E$13*12,0)","v":0},36,0,{"$f":"IF(R40>0,$H$5*Eingabe!$C$12,0)","v":0},0,0,null,45,6.3384215141250311E-2,6.9548722168907215E-2,7.5175661565411361E-2,206]
[null,null,null,0,3,3,1,207218.49342825223,{"$f":"H41*Eingabe!$C$11/12","v":259.02311678531527},906.58333333333337,647.56021654801816,906.58333333333348,206570.93321170422,259.02311678531527,null,{"$f":"IF(R41>0,Ausgabe!$E$13*12,0)","v":0},37,0,{"$f":"IF(R41>0,$H$5*Eingabe!$C$12,0)","v":0},0,0,null,46,6.2296701080489417E-2,6.9056352235824237E-2,7.4619919331163465E-2,194]
[null,null,null,0,3,3,2,206570.93321170422,{"$f":"H42*Eingabe!$C$11/12","v":258.21366651463023},906.58333333333337,648.36966681870308,906.58333333333326,205922.56354488552,517.2367832999455,null,{"$f":"IF(R42>0,Ausgabe!$E$13*12,0)","v":0},38,0,{"$f":"IF(R42>0,$H$5*Eingabe!$C$12,0)","v":0},0,0,null,47,6.1610382955836922E-2,6.8814395228106756E-2,7.3953539154081899E-2,182]
[null,null,null,0,3,3,3,205922.56354488552,{"$f":"H43*Eingabe!$C$11/12","v":257.40320443110687},906.58333333333337,649.18012890222644,906.58333333333326,205273.38341598329,774.63998773105232,null,{"$f":"IF(R43>0,Ausgabe!$E$13*12,0)","v":0},39,0,{"$f":"IF(R43>0,$H$5*Eingabe!$C$12,0)","v":0},0,0,null,48,6.319017543271202E-2,6.8593797223486005E-2,7.3322659432184897E-2,170]
[null,null,null,0,3,3,4,205273.38341598329,{"$f":"H44*Eingabe!$C$11/12","v":256.59172926997911},906.58333333333337,649.99160406335432,906.58333333333348,204623.39181191992,1031.2317170010315,null,{"$f":"IF(R44>0,Ausgabe!$E$13*12,0)","v":0},40,0,{"$f":"IF(R44>0,$H$5*Eingabe!$C$12,0)","v":0},0,0,null,49,6.3690500381869269E-2,6.8183357513505294E-2,7.2540754111505484E-2,158]
[null,null,null,0,3,3,5,204623.39181191992,{"$f":"H45*Eingabe!$C$11/12","v":255.7792397648999},906.58333333333337,650.80409356843347,906.58333333333337,203972.58771835148,1287.0109567659315,null,{"$f":"IF(R45>0,Ausgabe!$E$13*12,0)","v":0},41,0,{"$f":"IF(R45>0,$H$5*Eingabe!$C$12,0)","v":0},0,0,null,50,6.3015229520767491E-2,6.7752675873666013E-2,7.180926821675862E-2,146]
[null,null,null,0,3,3,6,203972.58771835148,{"$f":"H46*Eingabe!$C$11/12","v":254.96573464793934},906.58333333333337,651.617598685394,906.58333333333337,203320.97011966608,1541.9766914138709,null,{"$f":"IF(R46>0,Ausgabe!$E$13*12,0)","v":0},42,0,{"$f":"IF(R46>0,$H$5*Eingabe!$C$12,0)","v":0},0,0,null,51,6.2555641439965989E-2,6.7357062791891825E-2,7.1227569657017209E-2,134]
[null,null,null,0,3,3,7,203320.97011966608,{"$f":"H47*Eingabe!$C$11/12","v":254.15121264958259},906.58333333333337,652.43212068375078,906.58333333333337,202668.53799898233,1796.1279040634536,null,{"$f":"IF(R47>0,Ausgabe!$E$13*12,0)","v":0},43,0,{"$f":"IF(R47>0,$H$5*Eingabe!$C$12,0)","v":0},0,0,null,52,6.1723809534443147E-2,6.6994774677754762E-2,7.0582012373322789E-2,122]
[null,null,null,0,3,3,8,202668.53799898233,{"$f":"H48*Eingabe!$C$11/12","v":253.33567249872792},906.58333333333337,653.24766083460543,906.58333333333337,202015.29033814772,2049.4635765621815,null,{"$f":"IF(R48>0,Ausgabe!$E$13*12,0)","v":0},44,0,{"$f":"IF(R48>0,$H$5*Eingabe!$C$12,0)","v":0},0,0,null,53,6.0919875424809089E-2,6.6808312331773881E-2,7.0018949825619139E-2,110]
[null,null,null,0,3,3,9,202015.29033814772,{"$f":"H49*Eingabe!$C$11/12","v":252.51911292268463},906.58333333333337,654.06422041064877,906.58333333333337,201361.22611773707,2301.9826894848661,null,{"$f":"IF(R49>0,Ausgabe!$E$13*12,0)","v":0},45,0,{"$f":"IF(R49>0,$H$5*Eingabe!$C$12,0)","v":0},0,0,null,54,6.0562548669864394E-2,6.6890820348464858E-2,6.9357202437447224E-2,98]
[null,null,null,0,3,3,10,201361.22611773707,{"$f":"H50*Eingabe!$C$11/12","v":251.70153264717132},906.58333333333337,654.88180068616202,906.58333333333337,200706.34431705091,2553.6842221320376,null,{"$f":"IF(R50>0,Ausgabe!$E$13*12,0)","v":0},46,0,{"$f":"IF(R50>0,$H$5*Eingabe!$C$12,0)","v":0},0,0,null,55,6.2422463798288495E-2,6.6970882093384795E-2,6.8778680325110905E-2,86]
[null,null,null,0,3,3,11,200706.34431705091,{"$f":"H51*Eingabe!$C$11/12","v":250.88293039631364},906.58333333333337,655.7004029370197,906.58333333333337,200050.6439141139,2804.567152528351,null,{"$f":"IF(R51>0,Ausgabe!$E$13*12,0)","v":0},47,0,{"$f":"IF(R51>0,$H$5*Eingabe!$C$12,0)","v":0},0,0,null,56,6.380301590545398E-2,6.6874377095166082E-2,6.8381200149622248E-2,74]
[null,null,null,0,4,3,12,200050.6439141139,{"$f":"H52*Eingabe!$C$11/12","v":250.06330489264235},906.58333333333337,656.52002844069102,906.58333333333337,199394.12388567321,3054.6304574209935,null,{"$f":"IF(R52>0,Ausgabe!$E$13*12,0)","v":0},48,0,{"$f":"IF(R52>0,$H$5*Eingabe!$C$12,0)","v":0},0,0,null,57,6.4159464189452675E-2,6.6699765937169364E-2,6.7767909890470518E-2,62]
[null,null,null,0,4,4,1,199394.12388567321,{"$f":"H53*Eingabe!$C$11/12","v":249.24265485709148},906.58333333333337,657.34067847624192,906.58333333333337,198736.78320719698,249.24265485709148,null,{"$f":"IF(R53>0,Ausgabe!$E$13*12,0)","v":0},49,0,{"$f":"IF(R53>0,$H$5*Eingabe!$C$12,0)","v":0},0,0,null,58,6.5307640557062355E-2,6.644608485169963E-2,6.7100082178680159E-2,50]
[null,null,null,0,4,4,2,198736.78320719698,{"$f":"H54*Eingabe!$C$11/12","v":248.42097900899623},906.58333333333337,658.16235432433712,906.58333333333337,198078.62085287264,497.66363386608771,null,{"$f":"IF(R54>0,Ausgabe!$E$13*12,0)","v":0},50,0,{"$f":"IF(R54>0,$H$5*Eingabe!$C$12,0)","v":0},0,0,null,59,6.5710070773027013E-2,6.5948654912210941E-2,6.65881778542112E-2,38]
[null,null,null,0,4,4,3,198078.62085287264,{"$f":"H55*Eingabe!$C$11/12","v":247.59827606609079},906.58333333333337,658.98505726724261,906.58333333333337,197419.6357956054,745.26190993217847,null,{"$f":"IF(R55>0,Ausgabe!$E$13*12,0)","v":0},51,0,{"$f":"IF(R55>0,$H$5*Eingabe!$C$12,0)","v":0},0,0,null,60,6.4960280963716324E-2,6.5310603100397699E-2,6.6028008999371085E-2,26]
[null,null,null,0,4,4,4,197419.6357956054,{"$f":"H56*Eingabe!$C$11/12","v":246.77454474450676},906.58333333333337,659.80878858882659,906.58333333333337,196759.82700701657,992.03645467668525,null,{"$f":"IF(R56>0,Ausgabe!$E$13*12,0)","v":0},52,0,{"$f":"IF(R56>0,$H$5*Eingabe!$C$12,0)","v":0},0,0,null,61,"keine Daten vorhanden","keine Daten vorhanden","keine Daten vorhanden","keine Daten vorhanden"]
[null,null,null,0,4,4,5,196759.82700701657,{"$f":"H57*Eingabe!$C$11/12","v":245.94978375877074},906.58333333333337,660.63354957456261,906.58333333333337,196099.19345744202,1237.986238435456,null,{"$f":"IF(R57>0,Ausgabe!$E$13*12,0)","v":0},53,0,{"$f":"IF(R57>0,$H$5*Eingabe!$C$12,0)","v":0},0,0]
[null,null,null,0,4,4,6,196099.19345744202,{"$f":"H58*Eingabe!$C$11/12","v":245.12399182180252},906.58333333333337,661.45934151153085,906.58333333333337,195437.73411593048,1483.1102302572585,null,{"$f":"IF(R58>0,Ausgabe!$E$13*12,0)","v":0},54,0,{"$f":"IF(R58>0,$H$5*Eingabe!$C$12,0)","v":0},0,0]
[null,null,null,0,4,4,7,195437.73411593048,{"$f":"H59*Eingabe!$C$11/12","v":244.29716764491309},906.58333333333337,662.28616568842028,906.58333333333337,194775.44795024206,1727.4073979021716,null,{"$f":"IF(R59>0,Ausgabe!$E$13*12,0)","v":0},55,0,{"$f":"IF(R59>0,$H$5*Eingabe!$C$12,0)","v":0},0,0]
[null,null,null,0,4,4,8,194775.44795024206,{"$f":"H60*Eingabe!$C$11/12","v":243.46930993780256},906.58333333333337,663.11402339553081,906.58333333333337,194112.33392684654,1970.8767078399742,null,{"$f":"IF(R60>0,Ausgabe!$E$13*12,0)","v":0},56,0,{"$f":"IF(R60>0,$H$5*Eingabe!$C$12,0)","v":0},0,0]
[null,null,null,0,4,4,9,194112.33392684654,{"$f":"H61*Eingabe!$C$11/12","v":242.64041740855816},906.58333333333337,663.94291592477521,906.58333333333337,193448.39101092177,2213.5171252485325,null,{"$f":"IF(R61>0,Ausgabe!$E$13*12,0)","v":0},57,0,{"$f":"IF(R61>0,$H$5*Eingabe!$C$12,0)","v":0},0,0]
[null,null,null,0,4,4,10,193448.39101092177,{"$f":"H62*Eingabe!$C$11/12","v":241.81048876365219},906.58333333333337,664.77284456968118,906.58333333333337,192783.6181663521,2455.3276140121848,null,{"$f":"IF(R62>0,Ausgabe!$E$13*12,0)","v":0},58,0,{"$f":"IF(R62>0,$H$5*Eingabe!$C$12,0)","v":0},0,0]
[null,null,null,0,4,4,11,192783.6181663521,{"$f":"H63*Eingabe!$C$11/12","v":240.97952270794011},906.58333333333337,665.60381062539329,906.58333333333337,192118.01435572671,2696.3071367201251,null,{"$f":"IF(R63>0,Ausgabe!$E$13*12,0)","v":0},59,0,{"$f":"IF(R63>0,$H$5*Eingabe!$C$12,0)","v":0},0,0]
[null,null,null,0,5,4,12,192118.01435572671,{"$f":"H64*Eingabe!$C$11/12","v":240.14751794465838},906.58333333333337,666.435815388675,906.58333333333337,191451.57854033803,2936.4546546647834,null,{"$f":"IF(R64>0,Ausgabe!$E$13*12,0)","v":0},60,0,{"$f":"IF(R64>0,$H$5*Eingabe!$C$12,0)","v":0},0,0]
[null,null,null,0,5,5,1,191451.57854033803,{"$f":"H65*Eingabe!$C$11/12","v":239.31447317542253},906.58333333333337,667.26886015791081,906.58333333333337,190784.30968018013,239.31447317542253,null,{"$f":"IF(R65>0,Ausgabe!$E$13*12,0)","v":0},61,0,{"$f":"IF(R65>0,$H$5*Eingabe!$C$12,0)","v":0},0,0]
[null,null,null,0,5,5,2,190784.30968018013,{"$f":"H66*Eingabe!$C$11/12","v":238.48038710022516},906.58333333333337,668.10294623310824,906.58333333333337,190116.20673394701,477.79486027564769,null,{"$f":"IF(R66>0,Ausgabe!$E$13*12,0)","v":0},62,0,{"$f":"IF(R66>0,$H$5*Eingabe!$C$12,0)","v":0},0,0]
[null,null,null,0,5,5,3,190116.20673394701,{"$f":"H67*Eingabe!$C$11/12","v":237.64525841743375},906.58333333333337,668.93807491589962,906.58333333333337,189447.26865903111,715.44011869308144,null,{"$f":"IF(R67>0,Ausgabe!$E$13*12,0)","v":0},63,0,{"$f":"IF(R67>0,$H$5*Eingabe!$C$12,0)","v":0},0,0]
[null,null,null,0,5,5,4,189447.26865903111,{"$f":"H68*Eingabe!$C$11/12","v":236.80908582378888},906.58333333333337,669.77424750954447,906.58333333333337,188777.49441152156,952.24920451687035,null,{"$f":"IF(R68>0,Ausgabe!$E$13*12,0)","v":0},64,0,{"$f":"IF(R68>0,$H$5*Eingabe!$C$12,0)","v":0},0,0]
[null,null,null,{"$f":"IF(AND(M69=0,M68>0),1,0)","v":0},5,5,5,188777.49441152156,{"$f":"H69*Eingabe!$C$11/12","v":235.97186801440193},906.58333333333337,670.61146531893144,906.58333333333337,188106.88294620262,1188.2210725312723,null,{"$f":"IF(R69>0,Ausgabe!$E$13*12,0)","v":0},65,{"$f":"VLOOKUP(Q69,E68:N860,10,FALSE)","v":0},{"$f":"IF(R69>0,$H$5*Eingabe!$C$12,0)","v":0},0,0]
[null,null,null,0,5,5,6,188106.88294620262,{"$f":"H70*Eingabe!$C$11/12","v":235.13360368275326},{"$f":"IF(H70=0,0,J69)","v":906.58333333333337},671.44972965058014,906.58333333333337,{"$f":"IF(H70-K70<=0,0,H70-K70)","v":187435.43321655205},{"$f":"IF(G70=1,I70,I70+N69)","v":1423.3546762140256}]
[null,null,null,0,{"$f":"IF(G71=12,1+E70,E70)","v":5},5,7,{"$f":"M70","v":187435.43321655205},{"$f":"H71*Eingabe!$C$11/12","v":234.29429152069005},906.58333333333337,{"$f":"J71-I71","v":672.28904181264329},{"$f":"I71+K71","v":906.58333333333337},186763.1441747394,1657.6489677347156]
[null,null,null,0,5,5,8,186763.1441747394,{"$f":"H72*Eingabe!$C$11/12","v":233.45393021842423},906.58333333333337,673.12940311490911,906.58333333333337,186090.0147716245,1891.1028979531397]
[null,null,null,0,5,5,9,186090.0147716245,{"$f":"H73*Eingabe!$C$11/12","v":232.61251846453061},906.58333333333337,673.97081486880279,906.58333333333337,185416.04395675569,2123.7154164176704]
[null,null,null,0,5,5,10,185416.04395675569,{"$f":"H74*Eingabe!$C$11/12","v":231.77005494594459},906.58333333333337,674.81327838738878,906.58333333333337,184741.2306783683,2355.485471363615]
[null,null,null,0,5,5,11,184741.2306783683,{"$f":"H75*Eingabe!$C$11/12","v":230.92653834796036},906.58333333333337,675.65679498537304,906.58333333333337,184065.57388338292,2586.4120097115756]
[null,null,null,0,6,5,12,184065.57388338292,{"$f":"H76*Eingabe!$C$11/12","v":230.08196735422862},906.58333333333337,676.50136597910478,906.58333333333337,183389.07251740381,2816.4939770658043]
[null,null,null,0,6,6,1,183389.07251740381,{"$f":"H77*Eingabe!$C$11/12","v":229.23634064675477},906.58333333333337,677.34699268657857,906.58333333333337,182711.72552471724,229.23634064675477]
[null,null,null,0,6,6,2,182711.72552471724,{"$f":"H78*Eingabe!$C$11/12","v":228.38965690589654},906.58333333333337,678.1936764274368,906.58333333333337,182033.5318482898,457.62599755265131]
[null,null,null,0,6,6,3,182033.5318482898,{"$f":"H79*Eingabe!$C$11/12","v":227.54191481036221},906.58333333333337,679.04141852297118,906.58333333333337,181354.49042976683,685.16791236301356]
[null,null,null,0,6,6,4,181354.49042976683,{"$f":"H80*Eingabe!$C$11/12","v":226.69311303720852},906.58333333333337,679.89022029612488,906.58333333333337,180674.60020947069,911.86102540022205]
[null,null,null,0,6,6,5,180674.60020947069,{"$f":"H81*Eingabe!$C$11/12","v":225.84325026183834},906.58333333333337,680.74008307149506,906.58333333333337,179993.8601263992,1137.7042756620604]
[null,null,null,0,6,6,6,179993.8601263992,{"$f":"H82*Eingabe!$C$11/12","v":224.99232515799898},906.58333333333337,681.59100817533442,906.58333333333337,179312.26911822386,1362.6966008200593]
[null,null,null,0,6,6,7,179312.26911822386,{"$f":"H83*Eingabe!$C$11/12","v":224.14033639777983},906.58333333333337,682.44299693555354,906.58333333333337,178629.82612128832,1586.836937217839]
[null,null,null,0,6,6,8,178629.82612128832,{"$f":"H84*Eingabe!$C$11/12","v":223.28728265161041},906.58333333333337,683.29605068172293,906.58333333333337,177946.53007060659,1810.1242198694495]
[null,null,null,0,6,6,9,177946.53007060659,{"$f":"H85*Eingabe!$C$11/12","v":222.43316258825823},906.58333333333337,684.15017074507512,906.58333333333337,177262.37989986152,2032.5573824577077]
[null,null,null,0,6,6,10,177262.37989986152,{"$f":"H86*Eingabe!$C$11/12","v":221.57797487482688},906.58333333333337,685.00535845850652,906.58333333333337,176577.37454140303,2254.1353573325346]
[null,null,null,0,6,6,11,176577.37454140303,{"$f":"H87*Eingabe!$C$11/12","v":220.7217181767538},906.58333333333337,685.86161515657955,906.58333333333337,175891.51292624645,2474.8570755092883]
[null,null,null,0,7,6,12,175891.51292624645,{"$f":"H88*Eingabe!$C$11/12","v":219.86439115780806},906.58333333333337,686.71894217552529,906.58333333333337,175204.79398407092,2694.7214666670961]
[null,null,null,0,7,7,1,175204.79398407092,{"$f":"H89*Eingabe!$C$11/12","v":219.00599248008862},906.58333333333337,687.57734085324478,906.58333333333337,174517.21664321766,219.00599248008862]
[null,null,null,0,7,7,2,174517.21664321766,{"$f":"H90*Eingabe!$C$11/12","v":218.14652080402206},906.58333333333337,688.43681252931128,906.58333333333337,173828.77983068835,437.15251328411068]
[null,null,null,0,7,7,3,173828.77983068835,{"$f":"H91*Eingabe!$C$11/12","v":217.28597478836045},906.58333333333337,689.29735854497289,906.58333333333337,173139.48247214337,654.43848807247116]
[null,null,null,0,7,7,4,173139.48247214337,{"$f":"H92*Eingabe!$C$11/12","v":216.42435309017921},906.58333333333337,690.15898024315413,906.58333333333337,172449.32349190023,870.8628411626504]
[null,null,null,0,7,7,5,172449.32349190023,{"$f":"H93*Eingabe!$C$11/12","v":215.56165436487527},906.58333333333337,691.0216789684581,906.58333333333337,171758.30181293178,1086.4244955275258]
[null,null,null,0,7,7,6,171758.30181293178,{"$f":"H94*Eingabe!$C$11/12","v":214.69787726616471},906.58333333333337,691.88545606716866,906.58333333333337,171066.41635686462,1301.1223727936904]
[null,null,null,0,7,7,7,171066.41635686462,{"$f":"H95*Eingabe!$C$11/12","v":213.83302044608078},906.58333333333337,692.75031288725256,906.58333333333337,170373.66604397737,1514.9553932397712]
[null,null,null,0,7,7,8,170373.66604397737,{"$f":"H96*Eingabe!$C$11/12","v":212.96708255497171},906.58333333333337,693.61625077836163,906.58333333333337,169680.049793199,1727.9224757947429]
[null,null,null,0,7,7,9,169680.049793199,{"$f":"H97*Eingabe!$C$11/12","v":212.10006224149876},906.58333333333337,694.48327109183458,906.58333333333337,168985.56652210717,1940.0225380362417]
[null,null,null,0,7,7,10,168985.56652210717,{"$f":"H98*Eingabe!$C$11/12","v":211.23195815263395},906.58333333333337,695.35137518069939,906.58333333333337,168290.21514692646,2151.2544961888757]
[null,null,null,0,7,7,11,168290.21514692646,{"$f":"H99*Eingabe!$C$11/12","v":210.36276893365809},906.58333333333337,696.22056439967525,906.58333333333337,167593.99458252679,2361.6172651225338]
[null,null,null,0,8,7,12,167593.99458252679,{"$f":"H100*Eingabe!$C$11/12","v":209.49249322815851},906.58333333333337,697.09084010517483,906.58333333333337,166896.90374242162,2571.1097583506921]
[null,null,null,0,8,8,1,166896.90374242162,{"$f":"H101*Eingabe!$C$11/12","v":208.62112967802702},906.58333333333337,697.96220365530633,906.58333333333337,166198.94153876632,208.62112967802702]
[null,null,null,0,8,8,2,166198.94153876632,{"$f":"H102*Eingabe!$C$11/12","v":207.74867692345788},906.58333333333337,698.83465640987549,906.58333333333337,165500.10688235646,416.36980660148492]
[null,null,null,0,8,8,3,165500.10688235646,{"$f":"H103*Eingabe!$C$11/12","v":206.87513360294557},906.58333333333337,699.70819973038783,906.58333333333337,164800.39868262608,623.24494020443046]
[null,null,null,0,8,8,4,164800.39868262608,{"$f":"H104*Eingabe!$C$11/12","v":206.00049835328261},906.58333333333337,700.58283498005073,906.58333333333337,164099.81584764604,829.2454385577131]
[null,null,null,0,8,8,5,164099.81584764604,{"$f":"H105*Eingabe!$C$11/12","v":205.12476980955753},906.58333333333337,701.45856352377587,906.58333333333337,163398.35728412226,1034.3702083672706]
[null,null,null,0,8,8,6,163398.35728412226,{"$f":"H106*Eingabe!$C$11/12","v":204.24794660515283},906.58333333333337,702.33538672818054,906.58333333333337,162696.02189739409,1238.6181549724233]
[null,null,null,0,8,8,7,162696.02189739409,{"$f":"H107*Eingabe!$C$11/12","v":203.37002737174259},906.58333333333337,703.21330596159078,906.58333333333337,161992.80859143249,1441.988182344166]
[null,null,null,0,8,8,8,161992.80859143249,{"$f":"H108*Eingabe!$C$11/12","v":202.4910107392906},906.58333333333337,704.0923225940428,906.58333333333337,161288.71626883844,1644.4791930834567]
[null,null,null,0,8,8,9,161288.71626883844,{"$f":"H109*Eingabe!$C$11/12","v":201.61089533604806},906.58333333333337,704.97243799728528,906.58333333333337,160583.74383084115,1846.0900884195048]
[null,null,null,0,8,8,10,160583.74383084115,{"$f":"H110*Eingabe!$C$11/12","v":200.72967978855141},906.58333333333337,705.85365354478199,906.58333333333337,159877.89017729636,2046.8197682080563]
[null,null,null,0,8,8,11,159877.89017729636,{"$f":"H111*Eingabe!$C$11/12","v":199.84736272162044},906.58333333333337,706.7359706117129,906.58333333333337,159171.15420668465,2246.6671309296767]
[null,null,null,0,9,8,12,159171.15420668465,{"$f":"H112*Eingabe!$C$11/12","v":198.96394275835578},906.58333333333337,707.61939057497761,906.58333333333337,158463.53481610966,2445.6310736880323]
[null,null,null,0,9,9,1,158463.53481610966,{"$f":"H113*Eingabe!$C$11/12","v":198.07941852013707},906.58333333333337,708.50391481319627,906.58333333333337,157755.03090129647,198.07941852013707]
[null,null,null,0,9,9,2,157755.03090129647,{"$f":"H114*Eingabe!$C$11/12","v":197.1937886266206},906.58333333333337,709.38954470671274,906.58333333333337,157045.64135658977,395.27320714675767]
[null,null,null,0,9,9,3,157045.64135658977,{"$f":"H115*Eingabe!$C$11/12","v":196.30705169573719},906.58333333333337,710.27628163759618,906.58333333333337,156335.36507495216,591.58025884249491]
[null,null,null,0,9,9,4,156335.36507495216,{"$f":"H116*Eingabe!$C$11/12","v":195.41920634369021},906.58333333333337,711.16412698964314,906.58333333333337,155624.20094796253,786.99946518618515]
[null,null,null,0,9,9,5,155624.20094796253,{"$f":"H117*Eingabe!$C$11/12","v":194.53025118495316},906.58333333333337,712.05308214838021,906.58333333333337,154912.14786581416,981.52971637113831]
[null,null,null,0,9,9,6,154912.14786581416,{"$f":"H118*Eingabe!$C$11/12","v":193.64018483226769},906.58333333333337,712.94314850106571,906.58333333333337,154199.20471731308,1175.169901203406]
[null,null,null,0,9,9,7,154199.20471731308,{"$f":"H119*Eingabe!$C$11/12","v":192.74900589664136},906.58333333333337,713.83432743669198,906.58333333333337,153485.37038987639,1367.9189071000474]
[null,null,null,0,9,9,8,153485.37038987639,{"$f":"H120*Eingabe!$C$11/12","v":191.8567129873455},906.58333333333337,714.72662034598784,906.58333333333337,152770.6437695304,1559.7756200873928]
[null,null,null,0,9,9,9,152770.6437695304,{"$f":"H121*Eingabe!$C$11/12","v":190.963304711913},906.58333333333337,715.62002862142037,906.58333333333337,152055.02374090898,1750.7389247993058]
[null,null,null,0,9,9,10,152055.02374090898,{"$f":"H122*Eingabe!$C$11/12","v":190.06877967613619},906.58333333333337,716.51455365719721,906.58333333333337,151338.50918725177,1940.8077044754421]
[null,null,null,0,9,9,11,151338.50918725177,{"$f":"H123*Eingabe!$C$11/12","v":189.17313648406468},906.58333333333337,717.41019684926869,906.58333333333337,150621.0989904025,2129.9808409595066]
[null,null,null,0,10,9,12,150621.0989904025,{"$f":"H124*Eingabe!$C$11/12","v":188.27637373800312},906.58333333333337,718.30695959533023,906.58333333333337,149902.79203080718,2318.2572146975099]
[null,null,null,0,10,10,1,149902.79203080718,{"$f":"H125*Eingabe!$C$11/12","v":187.37849003850897},906.58333333333337,719.2048432948244,906.58333333333337,149183.58718751234,187.37849003850897]
[null,null,null,0,10,10,2,149183.58718751234,{"$f":"H126*Eingabe!$C$11/12","v":186.47948398439041},906.58333333333337,720.10384934894296,906.58333333333337,148463.48333816341,373.85797402289938]
[null,null,null,0,10,10,3,148463.48333816341,{"$f":"H127*Eingabe!$C$11/12","v":185.57935417270426},906.58333333333337,721.00397916062911,906.58333333333337,147742.47935900278,559.43732819560364]
[null,null,null,0,10,10,4,147742.47935900278,{"$f":"H128*Eingabe!$C$11/12","v":184.67809919875347},906.58333333333337,721.90523413457993,906.58333333333337,147020.5741248682,744.11542739435708]
[null,null,null,0,10,10,5,147020.5741248682,{"$f":"H129*Eingabe!$C$11/12","v":183.77571765608525},906.58333333333337,722.80761567724812,906.58333333333337,146297.76650919096,927.89114505044233]
[null,null,null,0,10,10,6,146297.76650919096,{"$f":"H130*Eingabe!$C$11/12","v":182.87220813648869},906.58333333333337,723.7111251968447,906.58333333333337,145574.05538399413,1110.763353186931]
[null,null,null,0,10,10,7,145574.05538399413,{"$f":"H131*Eingabe!$C$11/12","v":181.96756922999268},906.58333333333337,724.61576410334067,906.58333333333337,144849.43961989079,1292.7309224169237]
[null,null,null,0,10,10,8,144849.43961989079,{"$f":"H132*Eingabe!$C$11/12","v":181.06179952486346},906.58333333333337,725.52153380846994,906.58333333333337,144123.91808608233,1473.7927219417872]
[null,null,null,{"$f":"IF(AND(M133=0,M132>0),1,0)","v":0},10,10,9,144123.91808608233,{"$f":"H133*Eingabe!$C$11/12","v":180.15489760760292},906.58333333333337,726.42843572573042,906.58333333333337,143397.48965035658,1653.9476195493901]
[null,null,null,0,10,10,10,143397.48965035658,{"$f":"H134*Eingabe!$C$11/12","v":179.24686206294572},{"$f":"IF(H134=0,0,J133)","v":906.58333333333337},727.33647127038762,906.58333333333337,{"$f":"IF(H134-K134<=0,0,H134-K134)","v":142670.15317908619},{"$f":"IF(G134=1,I134,I134+N133)","v":1833.1944816123357}]
[null,null,null,0,{"$f":"IF(G135=12,1+E134,E134)","v":10},10,11,{"$f":"M134","v":142670.15317908619},{"$f":"H135*Eingabe!$C$11/12","v":178.33769147385772},906.58333333333337,{"$f":"J135-I135","v":728.24564185947565},{"$f":"I135+K135","v":906.58333333333337},141941.90753722671,2011.5321730861933]
[null,null,null,0,11,10,12,141941.90753722671,{"$f":"H136*Eingabe!$C$11/12","v":177.42738442153339},906.58333333333337,729.15594891180001,906.58333333333337,141212.75158831492,2188.9595575077269]
[null,null,null,0,11,11,1,141212.75158831492,{"$f":"H137*Eingabe!$C$11/12","v":176.51593948539366},906.58333333333337,730.06739384793968,906.58333333333337,140482.68419446697,176.51593948539366]
[null,null,null,0,11,11,2,140482.68419446697,{"$f":"H138*Eingabe!$C$11/12","v":175.60335524308371},906.58333333333337,730.97997809024969,906.58333333333337,139751.70421637673,352.11929472847737]
[null,null,null,0,11,11,3,139751.70421637673,{"$f":"H139*Eingabe!$C$11/12","v":174.68963027047093},906.58333333333337,731.89370306286241,906.58333333333337,139019.81051331386,526.80892499894833]
[null,null,null,0,11,11,4,139019.81051331386,{"$f":"H140*Eingabe!$C$11/12","v":173.77476314164232},906.58333333333337,732.80857019169105,906.58333333333337,138287.00194312216,700.58368814059065]
[null,null,null,0,11,11,5,138287.00194312216,{"$f":"H141*Eingabe!$C$11/12","v":172.85875242890268},906.58333333333337,733.7245809044307,906.58333333333337,137553.27736221772,873.44244056949333]
[null,null,null,0,11,11,6,137553.27736221772,{"$f":"H142*Eingabe!$C$11/12","v":171.94159670277213},906.58333333333337,734.64173663056124,906.58333333333337,136818.63562558717,1045.3840372722655]
[null,null,null,0,11,11,7,136818.63562558717,{"$f":"H143*Eingabe!$C$11/12","v":171.02329453198396},906.58333333333337,735.56003880134938,906.58333333333337,136083.07558678582,1216.4073318042495]
[null,null,null,0,11,11,8,136083.07558678582,{"$f":"H144*Eingabe!$C$11/12","v":170.10384448348228},906.58333333333337,736.47948884985112,906.58333333333337,135346.59609793598,1386.5111762877318]
[null,null,null,0,11,11,9,135346.59609793598,{"$f":"H145*Eingabe!$C$11/12","v":169.18324512241998},906.58333333333337,737.4000882109134,906.58333333333337,134609.19600972507,1555.6944214101518]
[null,null,null,0,11,11,10,134609.19600972507,{"$f":"H146*Eingabe!$C$11/12","v":168.26149501215633},906.58333333333337,738.32183832117698,906.58333333333326,133870.87417140391,1723.9559164223081]
[null,null,null,0,11,11,11,133870.87417140391,{"$f":"H147*Eingabe!$C$11/12","v":167.33859271425487},906.58333333333337,739.24474061907847,906.58333333333337,133131.62943078481,1891.294509136563]
[null,null,null,0,12,11,12,133131.62943078481,{"$f":"H148*Eingabe!$C$11/12","v":166.414536788481},906.58333333333337,740.1687965448524,906.58333333333337,132391.46063423995,2057.7090459250439]
[null,null,null,0,12,12,1,132391.46063423995,{"$f":"H149*Eingabe!$C$11/12","v":165.48932579279992},906.58333333333337,741.09400754053343,906.58333333333337,131650.36662669943,165.48932579279992]
[null,null,null,0,12,12,2,131650.36662669943,{"$f":"H150*Eingabe!$C$11/12","v":164.56295828337429},906.58333333333337,742.02037504995906,906.58333333333337,130908.34625164946,330.0522840761742]
[null,null,null,0,12,12,3,130908.34625164946,{"$f":"H151*Eingabe!$C$11/12","v":163.63543281456182},906.58333333333337,742.94790051877158,906.58333333333337,130165.39835113069,493.68771689073606]
[null,null,null,0,12,12,4,130165.39835113069,{"$f":"H152*Eingabe!$C$11/12","v":162.70674793891337},906.58333333333337,743.87658539441998,906.58333333333337,129421.52176573627,656.39446482964945]
[null,null,null,0,12,12,5,129421.52176573627,{"$f":"H153*Eingabe!$C$11/12","v":161.77690220717031},906.58333333333337,744.80643112616303,906.58333333333337,128676.7153346101,818.17136703681979]
[null,null,null,0,12,12,6,128676.7153346101,{"$f":"H154*Eingabe!$C$11/12","v":160.84589416826262},906.58333333333337,745.73743916507078,906.58333333333337,127930.97789544503,979.01726120508238]
[null,null,null,0,12,12,7,127930.97789544503,{"$f":"H155*Eingabe!$C$11/12","v":159.91372236930627},906.58333333333337,746.66961096402713,906.58333333333337,127184.308284481,1138.9309835743886]
[null,null,null,0,12,12,8,127184.308284481,{"$f":"H156*Eingabe!$C$11/12","v":158.98038535560124},906.58333333333337,747.60294797773213,906.58333333333337,126436.70533650326,1297.9113689299897]
[null,null,null,0,12,12,9,126436.70533650326,{"$f":"H157*Eingabe!$C$11/12","v":158.04588167062909},906.58333333333337,748.53745166270426,906.58333333333337,125688.16788484056,1455.9572506006189]
[null,null,null,0,12,12,10,125688.16788484056,{"$f":"H158*Eingabe!$C$11/12","v":157.11020985605069},906.58333333333337,749.47312347728268,906.58333333333337,124938.69476136328,1613.0674604566696]
[null,null,null,0,12,12,11,124938.69476136328,{"$f":"H159*Eingabe!$C$11/12","v":156.17336845170408},906.58333333333337,750.40996488162932,906.58333333333337,124188.28479648165,1769.2408289083737]
[null,null,null,0,13,12,12,124188.28479648165,{"$f":"H160*Eingabe!$C$11/12","v":155.23535599560205},906.58333333333337,751.34797733773132,906.58333333333337,123436.93681914391,1924.4761849039758]
[null,null,null,0,13,13,1,123436.93681914391,{"$f":"H161*Eingabe!$C$11/12","v":154.29617102392987},906.58333333333337,752.28716230940347,906.58333333333337,122684.6496568345,154.29617102392987]
[null,null,null,0,13,13,2,122684.6496568345,{"$f":"H162*Eingabe!$C$11/12","v":153.35581207104312},906.58333333333337,753.22752126229022,906.58333333333337,121931.42213557221,307.65198309497299]
[null,null,null,0,13,13,3,121931.42213557221,{"$f":"H163*Eingabe!$C$11/12","v":152.41427766946526},906.58333333333337,754.16905566386811,906.58333333333337,121177.25307990835,460.06626076443825]
[null,null,null,0,13,13,4,121177.25307990835,{"$f":"H164*Eingabe!$C$11/12","v":151.47156634988542},906.58333333333337,755.11176698344798,906.58333333333337,120422.1413129249,611.5378271143237]
[null,null,null,0,13,13,5,120422.1413129249,{"$f":"H165*Eingabe!$C$11/12","v":150.52767664115612},906.58333333333337,756.05565669217731,906.58333333333348,119666.08565623272,762.06550375547977]
[null,null,null,0,13,13,6,119666.08565623272,{"$f":"H166*Eingabe!$C$11/12","v":149.58260707029089},906.58333333333337,757.00072626304245,906.58333333333337,118909.08492996969,911.64811082577069]
[null,null,null,0,13,13,7,118909.08492996969,{"$f":"H167*Eingabe!$C$11/12","v":148.63635616246211},906.58333333333337,757.94697717087126,906.58333333333337,118151.13795279882,1060.2844669882329]
[null,null,null,0,13,13,8,118151.13795279882,{"$f":"H168*Eingabe!$C$11/12","v":147.68892244099851},906.58333333333337,758.89441089233492,906.58333333333348,117392.24354190649,1207.9733894292315]
[null,null,null,0,13,13,9,117392.24354190649,{"$f":"H169*Eingabe!$C$11/12","v":146.74030442738311},906.58333333333337,759.84302890595029,906.58333333333337,116632.40051300054,1354.7136938566146]
[null,null,null,0,13,13,10,116632.40051300054,{"$f":"H170*Eingabe!$C$11/12","v":145.79050064125067},906.58333333333337,760.7928326920827,906.58333333333337,115871.60768030846,1500.5041944978652]
[null,null,null,0,13,13,11,115871.60768030846,{"$f":"H171*Eingabe!$C$11/12","v":144.83950960038558},906.58333333333337,761.74382373294782,906.58333333333337,115109.86385657551,1645.3437040982508]
[null,null,null,0,14,13,12,115109.86385657551,{"$f":"H172*Eingabe!$C$11/12","v":143.88732982071937},906.58333333333337,762.69600351261397,906.58333333333337,114347.1678530629,1789.2310339189701]
[null,null,null,0,14,14,1,114347.1678530629,{"$f":"H173*Eingabe!$C$11/12","v":142.93395981632861},906.58333333333337,763.64937351700473,906.58333333333337,113583.51847954589,142.93395981632861]
[null,null,null,0,14,14,2,113583.51847954589,{"$f":"H174*Eingabe!$C$11/12","v":141.97939809943236},906.58333333333337,764.60393523390098,906.58333333333337,112818.91454431199,284.91335791576097]
[null,null,null,0,14,14,3,112818.91454431199,{"$f":"H175*Eingabe!$C$11/12","v":141.02364318039},906.58333333333337,765.5596901529434,906.58333333333337,112053.35485415904,425.93700109615099]
[null,null,null,0,14,14,4,112053.35485415904,{"$f":"H176*Eingabe!$C$11/12","v":140.06669356769879},906.58333333333337,766.51663976563464,906.58333333333348,111286.83821439341,566.00369466384973]
[null,null,null,0,14,14,5,111286.83821439341,{"$f":"H177*Eingabe!$C$11/12","v":139.10854776799178},906.58333333333337,767.47478556534156,906.58333333333337,110519.36342882807,705.11224243184154]
[null,null,null,0,14,14,6,110519.36342882807,{"$f":"H178*Eingabe!$C$11/12","v":138.14920428603509},906.58333333333337,768.43412904729826,906.58333333333337,109750.92929978078,843.26144671787665]
[null,null,null,0,14,14,7,109750.92929978078,{"$f":"H179*Eingabe!$C$11/12","v":137.18866162472597},906.58333333333337,769.39467170860735,906.58333333333326,108981.53462807217,980.45010834260256]
[null,null,null,0,14,14,8,108981.53462807217,{"$f":"H180*Eingabe!$C$11/12","v":136.22691828509019},906.58333333333337,770.35641504824321,906.58333333333337,108211.17821302393,1116.6770266276928]
[null,null,null,0,14,14,9,108211.17821302393,{"$f":"H181*Eingabe!$C$11/12","v":135.26397276627992},906.58333333333337,771.31936056705342,906.58333333333337,107439.85885245688,1251.9409993939728]
[null,null,null,0,14,14,10,107439.85885245688,{"$f":"H182*Eingabe!$C$11/12","v":134.29982356557107},906.58333333333337,772.28350976776233,906.58333333333337,106667.57534268912,1386.2408229595439]
[null,null,null,0,14,14,11,106667.57534268912,{"$f":"H183*Eingabe!$C$11/12","v":133.33446917836139},906.58333333333337,773.24886415497201,906.58333333333337,105894.32647853415,1519.5752921379053]
[null,null,null,0,15,14,12,105894.32647853415,{"$f":"H184*Eingabe!$C$11/12","v":132.36790809816767},906.58333333333337,774.21542523516564,906.58333333333326,105120.11105329898,1651.9432002360729]
[null,null,null,0,15,15,1,105120.11105329898,{"$f":"H185*Eingabe!$C$11/12","v":131.40013881662372},906.58333333333337,775.18319451670959,906.58333333333326,104344.92785878228,131.40013881662372]
[null,null,null,0,15,15,2,104344.92785878228,{"$f":"H186*Eingabe!$C$11/12","v":130.43115982347783},906.58333333333337,776.15217350985552,906.58333333333337,103568.77568527243,261.83129864010152]
[null,null,null,0,15,15,3,103568.77568527243,{"$f":"H187*Eingabe!$C$11/12","v":129.46096960659054},906.58333333333337,777.12236372674283,906.58333333333337,102791.65332154569,391.29226824669206]
[null,null,null,0,15,15,4,102791.65332154569,{"$f":"H188*Eingabe!$C$11/12","v":128.48956665193211},906.58333333333337,778.09376668140123,906.58333333333337,102013.55955486429,519.7818348986242]
[null,null,null,0,15,15,5,102013.55955486429,{"$f":"H189*Eingabe!$C$11/12","v":127.51694944358036},906.58333333333337,779.06638388975307,906.58333333333348,101234.49317097453,647.2987843422045]
[null,null,null,0,15,15,6,101234.49317097453,{"$f":"H190*Eingabe!$C$11/12","v":126.54311646371815},906.58333333333337,780.04021686961528,906.58333333333348,100454.45295410491,773.84190080592271]
[null,null,null,0,15,15,7,100454.45295410491,{"$f":"H191*Eingabe!$C$11/12","v":125.56806619263114},906.58333333333337,781.01526714070224,906.58333333333337,99673.437686964215,899.40996699855384]
[null,null,null,0,15,15,8,99673.437686964215,{"$f":"H192*Eingabe!$C$11/12","v":124.59179710870525},906.58333333333337,781.99153622462813,906.58333333333337,98891.44615073959,1024.0017641072591]
[null,null,null,0,15,15,9,98891.44615073959,{"$f":"H193*Eingabe!$C$11/12","v":123.61430768842449},906.58333333333337,782.96902564490892,906.58333333333337,98108.47712509468,1147.6160717956836]
[null,null,null,0,15,15,10,98108.47712509468,{"$f":"H194*Eingabe!$C$11/12","v":122.63559640636834},906.58333333333337,783.94773692696504,906.58333333333337,97324.529388167721,1270.2516682020519]
[null,null,null,0,15,15,11,97324.529388167721,{"$f":"H195*Eingabe!$C$11/12","v":121.65566173520965},906.58333333333337,784.92767159812377,906.58333333333337,96539.601716569596,1391.9073299372615]
[null,null,null,0,16,15,12,96539.601716569596,{"$f":"H196*Eingabe!$C$11/12","v":120.67450214571198},906.58333333333337,785.90883118762144,906.58333333333348,95753.69288538197,1512.5818320829735]
[null,null,null,{"$f":"IF(AND(M197=0,M196>0),1,0)","v":0},16,16,1,95753.69288538197,{"$f":"H197*Eingabe!$C$11/12","v":119.69211610672745},906.58333333333337,786.89121722660593,906.58333333333337,94966.801668155371,119.69211610672745]
[null,null,null,0,16,16,2,94966.801668155371,{"$f":"H198*Eingabe!$C$11/12","v":118.70850208519421},{"$f":"IF(H198=0,0,J197)","v":906.58333333333337},787.87483124813912,906.58333333333337,{"$f":"IF(H198-K198<=0,0,H198-K198)","v":94178.926836907238},{"$f":"IF(G198=1,I198,I198+N197)","v":238.40061819192167}]
[null,null,null,0,{"$f":"IF(G199=12,1+E198,E198)","v":16},16,3,{"$f":"M198","v":94178.926836907238},{"$f":"H199*Eingabe!$C$11/12","v":117.72365854613405},906.58333333333337,{"$f":"J199-I199","v":788.85967478719931},{"$f":"I199+K199","v":906.58333333333337},93390.067162120045,356.1242767380557]
[null,null,null,0,16,16,4,93390.067162120045,{"$f":"H200*Eingabe!$C$11/12","v":116.73758395265004},906.58333333333337,789.84574938068329,906.58333333333337,92600.221412739367,472.86186069070573]
[null,null,null,0,16,16,5,92600.221412739367,{"$f":"H201*Eingabe!$C$11/12","v":115.7502767659242},906.58333333333337,790.83305656740913,906.58333333333337,91809.388356171956,588.61213745662997]
[null,null,null,0,16,16,6,91809.388356171956,{"$f":"H202*Eingabe!$C$11/12","v":114.76173544521494},906.58333333333337,791.82159788811839,906.58333333333337,91017.566758283836,703.37387290184495]
[null,null,null,0,16,16,7,91017.566758283836,{"$f":"H203*Eingabe!$C$11/12","v":113.77195844785479},906.58333333333337,792.81137488547859,906.58333333333337,90224.755383398355,817.14583134969973]
[null,null,null,0,16,16,8,90224.755383398355,{"$f":"H204*Eingabe!$C$11/12","v":112.78094422924794},906.58333333333337,793.80238910408548,906.58333333333337,89430.952994294275,929.92677557894763]
[null,null,null,0,16,16,9,89430.952994294275,{"$f":"H205*Eingabe!$C$11/12","v":111.78869124286784},906.58333333333337,794.79464209046557,906.58333333333337,88636.158352203813,1041.7154668218154]
[null,null,null,0,16,16,10,88636.158352203813,{"$f":"H206*Eingabe!$C$11/12","v":110.79519794025477},906.58333333333337,795.78813539307862,906.58333333333337,87840.370216810741,1152.5106647620703]
[null,null,null,0,16,16,11,87840.370216810741,{"$f":"H207*Eingabe!$C$11/12","v":109.80046277101343},906.58333333333337,796.78287056231989,906.58333333333326,87043.587346248416,1262.3111275330837]
[null,null,null,0,17,16,12,87043.587346248416,{"$f":"H208*Eingabe!$C$11/12","v":108.80448418281053},906.58333333333337,797.77884915052289,906.58333333333337,86245.808497097896,1371.1156117158941]
[null,null,null,0,17,17,1,86245.808497097896,{"$f":"H209*Eingabe!$C$11/12","v":107.80726062137238},906.58333333333337,798.77607271196098,906.58333333333337,85447.032424385936,107.80726062137238]
[null,null,null,0,17,17,2,85447.032424385936,{"$f":"H210*Eingabe!$C$11/12","v":106.80879053048243},906.58333333333337,799.77454280285099,906.58333333333337,84647.257881583078,214.6160511518548]
[null,null,null,0,17,17,3,84647.257881583078,{"$f":"H211*Eingabe!$C$11/12","v":105.80907235197884},906.58333333333337,800.77426098135447,906.58333333333326,83846.483620601721,320.42512350383367]
[null,null,null,0,17,17,4,83846.483620601721,{"$f":"H212*Eingabe!$C$11/12","v":104.80810452575214},906.58333333333337,801.77522880758124,906.58333333333337,83044.708391794135,425.2332280295858]
[null,null,null,0,17,17,5,83044.708391794135,{"$f":"H213*Eingabe!$C$11/12","v":103.80588548974266},906.58333333333337,802.77744784359072,906.58333333333337,82241.930943950545,529.03911351932845]
[null,null,null,0,17,17,6,82241.930943950545,{"$f":"H214*Eingabe!$C$11/12","v":102.80241367993818},906.58333333333337,803.78091965339513,906.58333333333326,81438.150024297152,631.84152719926669]
[null,null,null,0,17,17,7,81438.150024297152,{"$f":"H215*Eingabe!$C$11/12","v":101.79768753037143},906.58333333333337,804.78564580296188,906.58333333333326,80633.364378494196,733.63921472963807]
[null,null,null,0,17,17,8,80633.364378494196,{"$f":"H216*Eingabe!$C$11/12","v":100.79170547311774},906.58333333333337,805.79162786021561,906.58333333333337,79827.572750633975,834.43092020275583]
[null,null,null,0,17,17,9,79827.572750633975,{"$f":"H217*Eingabe!$C$11/12","v":99.784465938292456},906.58333333333337,806.79886739504093,906.58333333333337,79020.77388323893,934.21538614104827]
[null,null,null,0,17,17,10,79020.77388323893,{"$f":"H218*Eingabe!$C$11/12","v":98.77596735404866},906.58333333333337,807.80736597928467,906.58333333333337,78212.966517259643,1032.991353495097]
[null,null,null,0,17,17,11,78212.966517259643,{"$f":"H219*Eingabe!$C$11/12","v":97.766208146574556},906.58333333333337,808.81712518675886,906.58333333333337,77404.149392072883,1130.7575616416716]
[null,null,null,0,18,17,12,77404.149392072883,{"$f":"H220*Eingabe!$C$11/12","v":96.755186740091105},906.58333333333337,809.82814659324231,906.58333333333337,76594.321245479645,1227.5127483817628]
[null,null,null,0,18,18,1,76594.321245479645,{"$f":"H221*Eingabe!$C$11/12","v":95.74290155684956},906.58333333333337,810.8404317764838,906.58333333333337,75783.480813703165,95.74290155684956]
[null,null,null,0,18,18,2,75783.480813703165,{"$f":"H222*Eingabe!$C$11/12","v":94.729351017128963},906.58333333333337,811.85398231620445,906.58333333333337,74971.626831386966,190.47225257397852]
[null,null,null,0,18,18,3,74971.626831386966,{"$f":"H223*Eingabe!$C$11/12","v":93.714533539233699},906.58333333333337,812.86879979409969,906.58333333333337,74158.758031592864,284.18678611321224]
[null,null,null,0,18,18,4,74158.758031592864,{"$f":"H224*Eingabe!$C$11/12","v":92.698447539491085},906.58333333333337,813.88488579384227,906.58333333333337,73344.873145799022,376.88523365270333]
[null,null,null,0,18,18,5,73344.873145799022,{"$f":"H225*Eingabe!$C$11/12","v":91.681091432248778},906.58333333333337,814.90224190108461,906.58333333333337,72529.970903897934,468.5663250849521]
[null,null,null,0,18,18,6,72529.970903897934,{"$f":"H226*Eingabe!$C$11/12","v":90.66246362987242},906.58333333333337,815.92086970346099,906.58333333333337,71714.050034194472,559.22878871482453]
[null,null,null,0,18,18,7,71714.050034194472,{"$f":"H227*Eingabe!$C$11/12","v":89.642562542743079},906.58333333333337,816.94077079059025,906.58333333333337,70897.10926340388,648.87135125756765]
[null,null,null,0,18,18,8,70897.10926340388,{"$f":"H228*Eingabe!$C$11/12","v":88.62138657925486},906.58333333333337,817.96194675407855,906.58333333333337,70079.147316649804,737.49273783682247]
[null,null,null,0,18,18,9,70079.147316649804,{"$f":"H229*Eingabe!$C$11/12","v":87.598934145812265},906.58333333333337,818.98439918752115,906.58333333333337,69260.162917462279,825.09167198263469]
[null,null,null,0,18,18,10,69260.162917462279,{"$f":"H230*Eingabe!$C$11/12","v":86.575203646827845},906.58333333333337,820.00812968650553,906.58333333333337,68440.154787775769,911.66687562946254]
[null,null,null,0,18,18,11,68440.154787775769,{"$f":"H231*Eingabe!$C$11/12","v":85.550193484719713},906.58333333333337,821.0331398486137,906.58333333333337,67619.121647927153,997.21706911418221]
[null,null,null,0,19,18,12,67619.121647927153,{"$f":"H232*Eingabe!$C$11/12","v":84.523902059908934},906.58333333333337,822.05943127342448,906.58333333333337,66797.062216653736,1081.7409711740911]
[null,null,null,0,19,19,1,66797.062216653736,{"$f":"H233*Eingabe!$C$11/12","v":83.49632777081716},906.58333333333337,823.0870055625162,906.58333333333337,65973.975211091223,83.49632777081716]
[null,null,null,0,19,19,2,65973.975211091223,{"$f":"H234*Eingabe!$C$11/12","v":82.467469013864033},906.58333333333337,824.11586431946932,906.58333333333337,65149.859346771751,165.96379678468119]
[null,null,null,0,19,19,3,65149.859346771751,{"$f":"H235*Eingabe!$C$11/12","v":81.437324183464682},906.58333333333337,825.14600914986863,906.58333333333326,64324.713337621884,247.40112096814588]
[null,null,null,0,19,19,4,64324.713337621884,{"$f":"H236*Eingabe!$C$11/12","v":80.405891672027352},906.58333333333337,826.17744166130603,906.58333333333337,63498.53589596058,327.80701264017324]
[null,null,null,0,19,19,5,63498.53589596058,{"$f":"H237*Eingabe!$C$11/12","v":79.373169869950729},906.58333333333337,827.21016346338263,906.58333333333337,62671.3257324972,407.18018251012398]
[null,null,null,0,19,19,6,62671.3257324972,{"$f":"H238*Eingabe!$C$11/12","v":78.339157165621501},906.58333333333337,828.24417616771188,906.58333333333337,61843.081556329489,485.51933967574547]
[null,null,null,0,19,19,7,61843.081556329489,{"$f":"H239*Eingabe!$C$11/12","v":77.303851945411864},906.58333333333337,829.27948138792146,906.58333333333337,61013.802074941566,562.82319162115732]
[null,null,null,0,19,19,8,61013.802074941566,{"$f":"H240*Eingabe!$C$11/12","v":76.267252593676957},906.58333333333337,830.3160807396564,906.58333333333337,60183.48599420191,639.09044421483429]
[null,null,null,0,19,19,9,60183.48599420191,{"$f":"H241*Eingabe!$C$11/12","v":75.229357492752385},906.58333333333337,831.35397584058103,906.58333333333337,59352.132018361328,714.31980170758663]
[null,null,null,0,19,19,10,59352.132018361328,{"$f":"H242*Eingabe!$C$11/12","v":74.19016502295166},906.58333333333337,832.39316831038172,906.58333333333337,58519.738850050948,788.50996673053828]
[null,null,null,0,19,19,11,58519.738850050948,{"$f":"H243*Eingabe!$C$11/12","v":73.149673562563677},906.58333333333337,833.43365977076974,906.58333333333337,57686.305190280182,861.65964029310192]
[null,null,null,0,20,19,12,57686.305190280182,{"$f":"H244*Eingabe!$C$11/12","v":72.107881487850221},906.58333333333337,834.47545184548312,906.58333333333337,56851.829738434695,933.76752178095217]
[null,null,null,0,20,20,1,56851.829738434695,{"$f":"H245*Eingabe!$C$11/12","v":71.064787173043371},906.58333333333337,835.51854616029004,906.58333333333337,56016.311192274406,71.064787173043371]
[null,null,null,0,20,20,2,56016.311192274406,{"$f":"H246*Eingabe!$C$11/12","v":70.020388990343008},906.58333333333337,836.56294434299036,906.58333333333337,55179.748247931413,141.08517616338639]
[null,null,null,0,20,20,3,55179.748247931413,{"$f":"H247*Eingabe!$C$11/12","v":68.974685309914264},906.58333333333337,837.60864802341916,906.58333333333348,54342.13959990799,210.05986147330066]
[null,null,null,0,20,20,4,54342.13959990799,{"$f":"H248*Eingabe!$C$11/12","v":67.927674499884986},906.58333333333337,838.65565883344834,906.58333333333337,53503.483941074541,277.98753597318563]
[null,null,null,0,20,20,5,53503.483941074541,{"$f":"H249*Eingabe!$C$11/12","v":66.879354926343169},906.58333333333337,839.70397840699025,906.58333333333337,52663.779962667548,344.86689089952881]
[null,null,null,0,20,20,6,52663.779962667548,{"$f":"H250*Eingabe!$C$11/12","v":65.829724953334434},906.58333333333337,840.75360837999892,906.58333333333337,51823.026354287547,410.69661585286326]
[null,null,null,0,20,20,7,51823.026354287547,{"$f":"H251*Eingabe!$C$11/12","v":64.778782942859436},906.58333333333337,841.80455039047388,906.58333333333326,50981.221803897075,475.4753987957227]
[null,null,null,0,20,20,8,50981.221803897075,{"$f":"H252*Eingabe!$C$11/12","v":63.726527254871343},906.58333333333337,842.856806078462,906.58333333333337,50138.364997818615,539.20192605059401]
[null,null,null,0,20,20,9,50138.364997818615,{"$f":"H253*Eingabe!$C$11/12","v":62.67295624727327},906.58333333333337,843.91037708606007,906.58333333333337,49294.454620732555,601.87488229786732]
[null,null,null,0,20,20,10,49294.454620732555,{"$f":"H254*Eingabe!$C$11/12","v":61.618068275915697},906.58333333333337,844.9652650574177,906.58333333333337,48449.489355675134,663.49295057378299]
[null,null,null,0,20,20,11,48449.489355675134,{"$f":"H255*Eingabe!$C$11/12","v":60.561861694593915},906.58333333333337,846.02147163873951,906.58333333333348,47603.467884036392,724.05481226837696]
[null,null,null,0,21,20,12,47603.467884036392,{"$f":"H256*Eingabe!$C$11/12","v":59.504334855045492},906.58333333333337,847.07899847828787,906.58333333333337,46756.388885558103,783.55914712342246]
[null,null,null,0,21,21,1,46756.388885558103,{"$f":"H257*Eingabe!$C$11/12","v":58.445486106947619},906.58333333333337,848.1378472263857,906.58333333333337,45908.25103833172,58.445486106947619]
[null,null,null,0,21,21,2,45908.25103833172,{"$f":"H258*Eingabe!$C$11/12","v":57.385313797914648},906.58333333333337,849.19801953541878,906.58333333333348,45059.053018796301,115.83079990486226]
[null,null,null,0,21,21,3,45059.053018796301,{"$f":"H259*Eingabe!$C$11/12","v":56.323816273495375},906.58333333333337,850.259517059838,906.58333333333337,44208.793501736465,172.15461617835763]
[null,null,null,0,21,21,4,44208.793501736465,{"$f":"H260*Eingabe!$C$11/12","v":55.260991877170575},906.58333333333337,851.3223414561628,906.58333333333337,43357.4711602803,227.4156080555282]
[null,null,null,{"$f":"IF(AND(M261=0,M260>0),1,0)","v":0},21,21,5,43357.4711602803,{"$f":"H261*Eingabe!$C$11/12","v":54.196838950350376},906.58333333333337,852.38649438298296,906.58333333333337,42505.084665897317,281.61244700587855]
[null,null,null,0,21,21,6,42505.084665897317,{"$f":"H262*Eingabe!$C$11/12","v":53.131355832371646},{"$f":"IF(H262=0,0,J261)","v":906.58333333333337},853.45197750096168,906.58333333333337,{"$f":"IF(H262-K262<=0,0,H262-K262)","v":41651.632688396356},{"$f":"IF(G262=1,I262,I262+N261)","v":334.74380283825019}]
[null,null,null,0,{"$f":"IF(G263=12,1+E262,E262)","v":21},21,7,{"$f":"M262","v":41651.632688396356},{"$f":"H263*Eingabe!$C$11/12","v":52.064540860495441},906.58333333333337,{"$f":"J263-I263","v":854.51879247283796},{"$f":"I263+K263","v":906.58333333333337},40797.113895923518,386.8083436987456]
[null,null,null,0,21,21,8,40797.113895923518,{"$f":"H264*Eingabe!$C$11/12","v":50.996392369904392},906.58333333333337,855.58694096342902,906.58333333333337,39941.526954960085,437.80473606865002]
[null,null,null,0,21,21,9,39941.526954960085,{"$f":"H265*Eingabe!$C$11/12","v":49.926908693700106},906.58333333333337,856.65642463963331,906.58333333333337,39084.870530320455,487.73164476235013]
[null,null,null,0,21,21,10,39084.870530320455,{"$f":"H266*Eingabe!$C$11/12","v":48.856088162900569},906.58333333333337,857.72724517043275,906.58333333333337,38227.143285150021,536.58773292525075]
[null,null,null,0,21,21,11,38227.143285150021,{"$f":"H267*Eingabe!$C$11/12","v":47.783929106437519},906.58333333333337,858.79940422689583,906.58333333333337,37368.343880923123,584.37166203168829]
[null,null,null,0,22,21,12,37368.343880923123,{"$f":"H268*Eingabe!$C$11/12","v":46.710429851153897},906.58333333333337,859.87290348217948,906.58333333333337,36508.470977440942,631.08209188284218]
[null,null,null,0,22,22,1,36508.470977440942,{"$f":"H269*Eingabe!$C$11/12","v":45.635588721801177},906.58333333333337,860.94774461153224,906.58333333333337,35647.523232829408,45.635588721801177]
[null,null,null,0,22,22,{"$f":"IF(G269+1=13,1,G269+1)","v":2},35647.523232829408,{"$f":"H270*Eingabe!$C$11/12","v":44.559404041036764},906.58333333333337,862.02392929229666,906.58333333333337,34785.499303537108,90.194992762837941]
[null,null,null,0,22,22,3,34785.499303537108,{"$f":"H271*Eingabe!$C$11/12","v":43.481874129421385},906.58333333333337,863.10145920391199,906.58333333333337,33922.397844333194,133.67686689225934]
[null,null,null,0,22,22,4,33922.397844333194,{"$f":"H272*Eingabe!$C$11/12","v":42.402997305416491},906.58333333333337,864.18033602791684,906.58333333333337,33058.217508305279,176.07986419767582]
[null,null,null,0,22,22,5,33058.217508305279,{"$f":"H273*Eingabe!$C$11/12","v":41.322771885381599},906.58333333333337,865.26056144795177,906.58333333333337,32192.956946857328,217.40263608305742]
[null,null,null,0,22,22,6,32192.956946857328,{"$f":"H274*Eingabe!$C$11/12","v":40.24119618357166},906.58333333333337,866.3421371497617,906.58333333333337,31326.614809707567,257.64383226662909]
[null,null,null,0,22,22,7,31326.614809707567,{"$f":"H275*Eingabe!$C$11/12","v":39.158268512134462},906.58333333333337,867.42506482119893,906.58333333333337,30459.189744886367,296.80210077876353]
[null,null,null,0,22,22,8,30459.189744886367,{"$f":"H276*Eingabe!$C$11/12","v":38.07398718110796},906.58333333333337,868.50934615222536,906.58333333333337,29590.680398734141,334.87608795987148]
[null,null,null,0,22,22,9,29590.680398734141,{"$f":"H277*Eingabe!$C$11/12","v":36.988350498417674},906.58333333333337,869.59498283491575,906.58333333333348,28721.085415899226,371.86443845828916]
[null,null,null,0,22,22,10,28721.085415899226,{"$f":"H278*Eingabe!$C$11/12","v":35.901356769874035},906.58333333333337,870.68197656345933,906.58333333333337,27850.403439335765,407.7657952281632]
[null,null,null,0,22,22,11,27850.403439335765,{"$f":"H279*Eingabe!$C$11/12","v":34.813004299169705},906.58333333333337,871.77032903416364,906.58333333333337,26978.633110301602,442.57879952733288]
[null,null,null,0,23,22,12,26978.633110301602,{"$f":"H280*Eingabe!$C$11/12","v":33.723291387877005},906.58333333333337,872.86004194545637,906.58333333333337,26105.773068356146,476.30209091520987]
[null,null,null,0,23,23,1,26105.773068356146,{"$f":"H281*Eingabe!$C$11/12","v":32.632216335445179},906.58333333333337,873.95111699788822,906.58333333333337,25231.821951358259,32.632216335445179]
[null,null,null,0,23,23,2,25231.821951358259,{"$f":"H282*Eingabe!$C$11/12","v":31.53977743919782},906.58333333333337,875.04355589413558,906.58333333333337,24356.778395464124,64.171993774642999]
[null,null,null,0,23,23,3,24356.778395464124,{"$f":"H283*Eingabe!$C$11/12","v":30.445972994330152},906.58333333333337,876.13736033900318,906.58333333333337,23480.641035125122,94.617966768973147]
[null,null,null,0,23,23,4,23480.641035125122,{"$f":"H284*Eingabe!$C$11/12","v":29.3508012939064},906.58333333333337,877.23253203942693,906.58333333333337,22603.408503085695,123.96876806287955]
[null,null,null,0,23,23,5,22603.408503085695,{"$f":"H285*Eingabe!$C$11/12","v":28.254260628857114},906.58333333333337,878.32907270447629,906.58333333333337,21725.079430381218,152.22302869173666]
[null,null,null,0,23,23,6,21725.079430381218,{"$f":"H286*Eingabe!$C$11/12","v":27.156349287976521},906.58333333333337,879.4269840453569,906.58333333333337,20845.652446335862,179.37937797971318]
[null,null,null,0,23,23,7,20845.652446335862,{"$f":"H287*Eingabe!$C$11/12","v":26.057065557919827},906.58333333333337,880.52626777541354,906.58333333333337,19965.126178560447,205.43644353763301]
[null,null,null,0,23,23,8,19965.126178560447,{"$f":"H288*Eingabe!$C$11/12","v":24.956407723200559},906.58333333333337,881.62692561013284,906.58333333333337,19083.499252950314,230.39285126083357]
[null,null,null,0,23,23,9,19083.499252950314,{"$f":"H289*Eingabe!$C$11/12","v":23.854374066187891},906.58333333333337,882.72895926714546,906.58333333333337,18200.77029368317,254.24722532702145]
[null,null,null,0,23,23,10,18200.77029368317,{"$f":"H290*Eingabe!$C$11/12","v":22.750962867103961},906.58333333333337,883.83237046622946,906.58333333333337,17316.937923216941,276.99818819412542]
[null,null,null,0,23,23,11,17316.937923216941,{"$f":"H291*Eingabe!$C$11/12","v":21.646172404021176},906.58333333333337,884.9371609293122,906.58333333333337,16432.000762287629,298.64436059814659]
[null,null,null,0,24,23,12,16432.000762287629,{"$f":"H292*Eingabe!$C$11/12","v":20.540000952859536},906.58333333333337,886.04333238047388,906.58333333333337,15545.957429907156,319.18436155100613]
[null,null,null,0,24,24,1,15545.957429907156,{"$f":"H293*Eingabe!$C$11/12","v":19.432446787383942},906.58333333333337,887.15088654594945,906.58333333333337,14658.806543361206,19.432446787383942]
[null,null,null,0,24,24,2,14658.806543361206,{"$f":"H294*Eingabe!$C$11/12","v":18.323508179201507},906.58333333333337,888.25982515413182,906.58333333333337,13770.546718207075,37.755954966585449]
[null,null,null,0,24,24,3,13770.546718207075,{"$f":"H295*Eingabe!$C$11/12","v":17.213183397758844},906.58333333333337,889.37014993557455,906.58333333333337,12881.176568271501,54.969138364344289]
[null,null,null,0,24,24,4,12881.176568271501,{"$f":"H296*Eingabe!$C$11/12","v":16.101470710339374},906.58333333333337,890.48186262299396,906.58333333333337,11990.694705648508,71.070609074683659]
[null,null,null,0,24,24,5,11990.694705648508,{"$f":"H297*Eingabe!$C$11/12","v":14.988368382060635},906.58333333333337,891.59496495127269,906.58333333333337,11099.099740697235,86.058977456744287]
[null,null,null,0,24,24,6,11099.099740697235,{"$f":"H298*Eingabe!$C$11/12","v":13.873874675871543},906.58333333333337,892.70945865746182,906.58333333333337,10206.390282039773,99.932852132615835]
[null,null,null,0,24,24,7,10206.390282039773,{"$f":"H299*Eingabe!$C$11/12","v":12.757987852549716},906.58333333333337,893.82534548078365,906.58333333333337,9312.5649365589888,112.69083998516555]
[null,null,null,0,24,24,8,9312.5649365589888,{"$f":"H300*Eingabe!$C$11/12","v":11.640706170698735},906.58333333333337,894.94262716263461,906.58333333333337,8417.6223093963545,124.33154615586429]
[null,null,null,0,24,24,9,8417.6223093963545,{"$f":"H301*Eingabe!$C$11/12","v":10.522027886745443},906.58333333333337,896.06130544658788,906.58333333333337,7521.5610039497669,134.85357404260972]
[null,null,null,0,24,24,10,7521.5610039497669,{"$f":"H302*Eingabe!$C$11/12","v":9.4019512549372077},906.58333333333337,897.18138207839615,906.58333333333337,6624.3796218713705,144.25552529754694]
[null,null,null,0,24,24,11,6624.3796218713705,{"$f":"H303*Eingabe!$C$11/12","v":8.280474527339214},906.58333333333337,898.30285880599411,906.58333333333337,5726.0767630653763,152.53599982488615]
[null,null,null,0,25,24,12,5726.0767630653763,{"$f":"H304*Eingabe!$C$11/12","v":7.15759595383172},906.58333333333337,899.4257373795017,906.58333333333337,4826.6510256858746,159.69359577871788]
[null,null,null,0,25,25,1,4826.6510256858746,{"$f":"H305*Eingabe!$C$11/12","v":6.033313782107343},906.58333333333337,900.550019551226,906.58333333333337,3926.1010061346487,6.033313782107343]
[null,null,null,0,25,25,2,3926.1010061346487,{"$f":"H306*Eingabe!$C$11/12","v":4.9076262576683112},906.58333333333337,901.67570707566506,906.58333333333337,3024.4252990589839,10.940940039775654]
[null,null,null,0,25,25,3,3024.4252990589839,{"$f":"H307*Eingabe!$C$11/12","v":3.7805316238237299},906.58333333333337,902.80280170950959,906.58333333333337,2121.6224973494745,14.721471663599385]
[null,null,null,0,25,25,4,2121.6224973494745,{"$f":"H308*Eingabe!$C$11/12","v":2.6520281216868429},906.58333333333337,903.93130521164653,906.58333333333337,1217.691192137828,17.373499785286228]
[null,null,null,0,25,25,5,1217.691192137828,{"$f":"H309*Eingabe!$C$11/12","v":1.5221139901722849},906.58333333333337,905.06121934316104,906.58333333333337,312.62997279466697,18.895613775458514]
[null,null,null,1,25,25,6,312.62997279466697,{"$f":"H310*Eingabe!$C$11/12","v":0.39078746599333369},906.58333333333337,906.19254586734007,906.58333333333337,0,19.286401241451848]
[null,null,null,0,25,25,7,0,{"$f":"H311*Eingabe!$C$11/12","v":0},0,0,0,0,19.286401241451848]
[null,null,null,0,25,25,8,0,{"$f":"H312*Eingabe!$C$11/12","v":0},0,0,0,0,19.286401241451848]
[null,null,null,0,25,25,9,0,{"$f":"H313*Eingabe!$C$11/12","v":0},0,0,0,0,19.286401241451848]
[null,null,null,0,25,25,10,0,{"$f":"H314*Eingabe!$C$11/12","v":0},0,0,0,0,19.286401241451848]
[null,null,null,0,25,25,11,0,{"$f":"H315*Eingabe!$C$11/12","v":0},0,0,0,0,19.286401241451848]
[null,null,null,0,26,25,12,0,{"$f":"H316*Eingabe!$C$11/12","v":0},0,0,0,0,19.286401241451848]
[null,null,null,0,26,26,1,0,{"$f":"H317*Eingabe!$C$11/12","v":0},0,0,0,0,0]
[null,null,null,0,26,26,2,0,{"$f":"H318*Eingabe!$C$11/12","v":0},0,0,0,0,0]
[null,null,null,0,26,26,3,0,{"$f":"H319*Eingabe!$C$11/12","v":0},0,0,0,0,0]
[null,null,null,0,26,26,4,0,{"$f":"H320*Eingabe!$C$11/12","v":0},0,0,0,0,0]
[null,null,null,0,26,26,5,0,{"$f":"H321*Eingabe!$C$11/12","v":0},0,0,0,0,0]
[null,null,null,0,26,26,6,0,{"$f":"H322*Eingabe!$C$11/12","v":0},0,0,0,0,0]
[null,null,null,0,26,26,7,0,{"$f":"H323*Eingabe!$C$11/12","v":0},0,0,0,0,0]
[null,null,null,0,26,26,8,0,{"$f":"H324*Eingabe!$C$11/12","v":0},0,0,0,0,0]
[null,null,null,{"$f":"IF(AND(M325=0,M324>0),1,0)","v":0},26,26,9,0,{"$f":"H325*Eingabe!$C$11/12","v":0},0,0,0,0,0]
[null,null,null,0,26,26,10,0,{"$f":"H326*Eingabe!$C$11/12","v":0},{"$f":"IF(H326=0,0,J325)","v":0},0,0,{"$f":"IF(H326-K326<=0,0,H326-K326)","v":0},{"$f":"IF(G326=1,I326,I326+N325)","v":0}]
[null,null,null,0,{"$f":"IF(G327=12,1+E326,E326)","v":26},26,11,{"$f":"M326","v":0},{"$f":"H327*Eingabe!$C$11/12","v":0},0,{"$f":"J327-I327","v":0},{"$f":"I327+K327","v":0},0,0]
[null,null,null,0,27,26,12,0,{"$f":"H328*Eingabe!$C$11/12","v":0},0,0,0,0,0]
[null,null,null,0,27,27,1,0,{"$f":"H329*Eingabe!$C$11/12","v":0},0,0,0,0,0]
[null,null,null,0,27,27,2,0,{"$f":"H330*Eingabe!$C$11/12","v":0},0,0,0,0,0]
[null,null,null,0,27,27,3,0,{"$f":"H331*Eingabe!$C$11/12","v":0},0,0,0,0,0]
[null,null,null,0,27,27,4,0,{"$f":"H332*Eingabe!$C$11/12","v":0},0,0,0,0,0]
[null,null,null,0,27,27,5,0,{"$f":"H333*Eingabe!$C$11/12","v":0},0,0,0,0,0]
[null,null,null,0,27,27,{"$f":"IF(G333+1=13,1,G333+1)","v":6},0,{"$f":"H334*Eingabe!$C$11/12","v":0},0,0,0,0,0]
[null,null,null,0,27,27,7,0,{"$f":"H335*Eingabe!$C$11/12","v":0},0,0,0,0,0]
[null,null,null,0,27,27,8,0,{"$f":"H336*Eingabe!$C$11/12","v":0},0,0,0,0,0]
[null,null,null,0,27,27,9,0,{"$f":"H337*Eingabe!$C$11/12","v":0},0,0,0,0,0]
[null,null,null,0,27,27,10,0,{"$f":"H338*Eingabe!$C$11/12","v":0},0,0,0,0,0]
[null,null,null,0,27,27,11,0,{"$f":"H339*Eingabe!$C$11/12","v":0},0,0,0,0,0]
[null,null,null,0,28,27,12,0,{"$f":"H340*Eingabe!$C$11/12","v":0},0,0,0,0,0]
[null,null,null,0,28,28,1,0,{"$f":"H341*Eingabe!$C$11/12","v":0},0,0,0,0,0]
[null,null,null,0,28,28,2,0,{"$f":"H342*Eingabe!$C$11/12","v":0},0,0,0,0,0]
[null,null,null,0,28,28,3,0,{"$f":"H343*Eingabe!$C$11/12","v":0},0,0,0,0,0]
[null,null,null,0,28,28,4,0,{"$f":"H344*Eingabe!$C$11/12","v":0},0,0,0,0,0]
[null,null,null,0,28,28,5,0,{"$f":"H345*Eingabe!$C$11/12","v":0},0,0,0,0,0]
[null,null,null,0,28,28,6,0,{"$f":"H346*Eingabe!$C$11/12","v":0},0,0,0,0,0]
[null,null,null,0,28,28,7,0,{"$f":"H347*Eingabe!$C$11/12","v":0},0,0,0,0,0]
[null,null,null,0,28,28,8,0,{"$f":"H348*Eingabe!$C$11/12","v":0},0,0,0,0,0]
[null,null,null,0,28,28,9,0,{"$f":"H349*Eingabe!$C$11/12","v":0},0,0,0,0,0]
[null,null,null,0,28,28,10,0,{"$f":"H350*Eingabe!$C$11/12","v":0},0,0,0,0,0]
[null,null,null,0,28,28,11,0,{"$f":"H351*Eingabe!$C$11/12","v":0},0,0,0,0,0]
[null,null,null,0,29,28,12,0,{"$f":"H352*Eingabe!$C$11/12","v":0},0,0,0,0,0]
[null,null,null,0,29,29,1,0,{"$f":"H353*Eingabe!$C$11/12","v":0},0,0,0,0,0]
[null,null,null,0,29,29,2,0,{"$f":"H354*Eingabe!$C$11/12","v":0},0,0,0,0,0]
[null,null,null,0,29,29,3,0,{"$f":"H355*Eingabe!$C$11/12","v":0},0,0,0,0,0]
[null,null,null,0,29,29,4,0,{"$f":"H356*Eingabe!$C$11/12","v":0},0,0,0,0,0]
[null,null,null,0,29,29,5,0,{"$f":"H357*Eingabe!$C$11/12","v":0},0,0,0,0,0]
[null,null,null,0,29,29,6,0,{"$f":"H358*Eingabe!$C$11/12","v":0},0,0,0,0,0]
[null,null,null,0,29,29,7,0,{"$f":"H359*Eingabe!$C$11/12","v":0},0,0,0,0,0]
[null,null,null,0,29,29,8,0,{"$f":"H360*Eingabe!$C$11/12","v":0},0,0,0,0,0]
[null,null,null,0,29,29,9,0,{"$f":"H361*Eingabe!$C$11/12","v":0},0,0,0,0,0]
[null,null,null,0,29,29,10,0,{"$f":"H362*Eingabe!$C$11/12","v":0},0,0,0,0,0]
[null,null,null,0,29,29,11,0,{"$f":"H363*Eingabe!$C$11/12","v":0},0,0,0,0,0]
[null,null,null,0,30,29,12,0,{"$f":"H364*Eingabe!$C$11/12","v":0},0,0,0,0,0]
[null,null,null,0,30,30,1,0,{"$f":"H365*Eingabe!$C$11/12","v":0},0,0,0,0,0]
[null,null,null,0,30,30,2,0,{"$f":"H366*Eingabe!$C$11/12","v":0},0,0,0,0,0]
[null,null,null,0,30,30,3,0,{"$f":"H367*Eingabe!$C$11/12","v":0},0,0,0,0,0]
[null,null,null,0,30,30,4,0,{"$f":"H368*Eingabe!$C$11/12","v":0},0,0,0,0,0]
[null,null,null,0,30,30,5,0,{"$f":"H369*Eingabe!$C$11/12","v":0},0,0,0,0,0]
[null,null,null,0,30,30,6,0,{"$f":"H370*Eingabe!$C$11/12","v":0},0,0,0,0,0]
[null,null,null,0,30,30,7,0,{"$f":"H371*Eingabe!$C$11/12","v":0},0,0,0,0,0]
[null,null,null,0,30,30,8,0,{"$f":"H372*Eingabe!$C$11/12","v":0},0,0,0,0,0]
[null,null,null,0,30,30,9,0,{"$f":"H373*Eingabe!$C$11/12","v":0},0,0,0,0,0]
[null,null,null,0,30,30,10,0,{"$f":"H374*Eingabe!$C$11/12","v":0},0,0,0,0,0]
[null,null,null,0,30,30,11,0,{"$f":"H375*Eingabe!$C$11/12","v":0},0,0,0,0,0]
[null,null,null,0,31,30,12,0,{"$f":"H376*Eingabe!$C$11/12","v":0},0,0,0,0,0]
[null,null,null,0,31,31,1,0,{"$f":"H377*Eingabe!$C$11/12","v":0},0,0,0,0,0]
[null,null,null,0,31,31,2,0,{"$f":"H378*Eingabe!$C$11/12","v":0},0,0,0,0,0]
[null,null,null,0,31,31,3,0,{"$f":"H379*Eingabe!$C$11/12","v":0},0,0,0,0,0]
[null,null,null,0,31,31,4,0,{"$f":"H380*Eingabe!$C$11/12","v":0},0,0,0,0,0]
[null,null,null,0,31,31,5,0,{"$f":"H381*Eingabe!$C$11/12","v":0},0,0,0,0,0]
[null,null,null,0,31,31,6,0,{"$f":"H382*Eingabe!$C$11/12","v":0},0,0,0,0,0]
[null,null,null,0,31,31,7,0,{"$f":"H383*Eingabe!$C$11/12","v":0},0,0,0,0,0]
[null,null,null,0,31,31,8,0,{"$f":"H384*Eingabe!$C$11/12","v":0},0,0,0,0,0]
[null,null,null,0,31,31,9,0,{"$f":"H385*Eingabe!$C$11/12","v":0},0,0,0,0,0]
[null,null,null,0,31,31,10,0,{"$f":"H386*Eingabe!$C$11/12","v":0},0,0,0,0,0]
[null,null,null,0,31,31,11,0,{"$f":"H387*Eingabe!$C$11/12","v":0},0,0,0,0,0]
[null,null,null,0,32,31,12,0,{"$f":"H388*Eingabe!$C$11/12","v":0},0,0,0,0,0]
[null,null,null,{"$f":"IF(AND(M389=0,M388>0),1,0)","v":0},32,32,1,0,{"$f":"H389*Eingabe!$C$11/12","v":0},0,0,0,0,0]
[null,null,null,0,32,32,2,0,{"$f":"H390*Eingabe!$C$11/12","v":0},{"$f":"IF(H390=0,0,J389)","v":0},0,0,{"$f":"IF(H390-K390<=0,0,H390-K390)","v":0},{"$f":"IF(G390=1,I390,I390+N389)","v":0}]
[null,null,null,0,{"$f":"IF(G391=12,1+E390,E390)","v":32},32,3,{"$f":"M390","v":0},{"$f":"H391*Eingabe!$C$11/12","v":0},0,{"$f":"J391-I391","v":0},{"$f":"I391+K391","v":0},0,0]
[null,null,null,0,32,32,4,0,{"$f":"H392*Eingabe!$C$11/12","v":0},0,0,0,0,0]
[null,null,null,0,32,32,5,0,{"$f":"H393*Eingabe!$C$11/12","v":0},0,0,0,0,0]
[null,null,null,0,32,32,6,0,{"$f":"H394*Eingabe!$C$11/12","v":0},0,0,0,0,0]
[null,null,null,{"$f":"IF(AND(M395=0,M394>0),1,0)","v":0},32,32,7,0,{"$f":"H395*Eingabe!$C$11/12","v":0},0,0,0,0,0]
[null,null,null,0,32,32,8,0,{"$f":"H396*Eingabe!$C$11/12","v":0},0,0,0,0,0]
[null,null,null,0,32,32,9,0,{"$f":"H397*Eingabe!$C$11/12","v":0},0,0,0,0,0]
[null,null,null,0,32,32,{"$f":"IF(G397+1=13,1,G397+1)","v":10},0,{"$f":"H398*Eingabe!$C$11/12","v":0},0,0,0,0,0]
[null,null,null,0,32,32,11,0,{"$f":"H399*Eingabe!$C$11/12","v":0},0,0,0,0,0]
[null,null,null,0,33,32,12,0,{"$f":"H400*Eingabe!$C$11/12","v":0},0,0,0,0,0]
[null,null,null,0,33,33,1,0,{"$f":"H401*Eingabe!$C$11/12","v":0},0,0,0,0,0]
[null,null,null,0,33,33,2,0,{"$f":"H402*Eingabe!$C$11/12","v":0},0,0,0,0,0]
[null,null,null,0,33,33,3,0,{"$f":"H403*Eingabe!$C$11/12","v":0},0,0,0,0,0]
[null,null,null,0,33,33,4,0,{"$f":"H404*Eingabe!$C$11/12","v":0},0,0,0,0,0]
[null,null,null,0,33,33,5,0,{"$f":"H405*Eingabe!$C$11/12","v":0},0,0,0,0,0]
[null,null,null,0,33,33,6,0,{"$f":"H406*Eingabe!$C$11/12","v":0},0,0,0,0,0]
[null,null,null,0,33,33,7,0,{"$f":"H407*Eingabe!$C$11/12","v":0},0,0,0,0,0]
[null,null,null,0,33,33,8,0,{"$f":"H408*Eingabe!$C$11/12","v":0},0,0,0,0,0]
[null,null,null,0,33,33,9,0,{"$f":"H409*Eingabe!$C$11/12","v":0},0,0,0,0,0]
[null,null,null,0,33,33,10,0,{"$f":"H410*Eingabe!$C$11/12","v":0},0,0,0,0,0]
[null,null,null,0,33,33,11,0,{"$f":"H411*Eingabe!$C$11/12","v":0},0,0,0,0,0]
[null,null,null,0,34,33,12,0,{"$f":"H412*Eingabe!$C$11/12","v":0},0,0,0,0,0]
[null,null,null,0,34,34,1,0,{"$f":"H413*Eingabe!$C$11/12","v":0},0,0,0,0,0]
[null,null,null,0,34,34,2,0,{"$f":"H414*Eingabe!$C$11/12","v":0},0,0,0,0,0]
[null,null,null,0,34,34,3,0,{"$f":"H415*Eingabe!$C$11/12","v":0},0,0,0,0,0]
[null,null,null,0,34,34,4,0,{"$f":"H416*Eingabe!$C$11/12","v":0},0,0,0,0,0]
[null,null,null,0,34,34,5,0,{"$f":"H417*Eingabe!$C$11/12","v":0},0,0,0,0,0]
[null,null,null,0,34,34,6,0,{"$f":"H418*Eingabe!$C$11/12","v":0},0,0,0,0,0]
[null,null,null,0,34,34,7,0,{"$f":"H419*Eingabe!$C$11/12","v":0},0,0,0,0,0]
[null,null,null,0,34,34,8,0,{"$f":"H420*Eingabe!$C$11/12","v":0},0,0,0,0,0]
[null,null,null,0,34,34,9,0,{"$f":"H421*Eingabe!$C$11/12","v":0},0,0,0,0,0]
[null,null,null,0,34,34,10,0,{"$f":"H422*Eingabe!$C$11/12","v":0},0,0,0,0,0]
[null,null,null,0,34,34,11,0,{"$f":"H423*Eingabe!$C$11/12","v":0},0,0,0,0,0]
[null,null,null,0,35,34,12,0,{"$f":"H424*Eingabe!$C$11/12","v":0},0,0,0,0,0]
[null,null,null,0,35,35,1,0,{"$f":"H425*Eingabe!$C$11/12","v":0},0,0,0,0,0]
[null,null,null,0,35,35,2,0,{"$f":"H426*Eingabe!$C$11/12","v":0},0,0,0,0,0]
[null,null,null,0,35,35,3,0,{"$f":"H427*Eingabe!$C$11/12","v":0},0,0,0,0,0]
[null,null,null,0,35,35,4,0,{"$f":"H428*Eingabe!$C$11/12","v":0},0,0,0,0,0]
[null,null,null,0,35,35,5,0,{"$f":"H429*Eingabe!$C$11/12","v":0},0,0,0,0,0]
[null,null,null,0,35,35,6,0,{"$f":"H430*Eingabe!$C$11/12","v":0},0,0,0,0,0]
[null,null,null,0,35,35,7,0,{"$f":"H431*Eingabe!$C$11/12","v":0},0,0,0,0,0]
[null,null,null,0,35,35,8,0,{"$f":"H432*Eingabe!$C$11/12","v":0},0,0,0,0,0]
[null,null,null,0,35,35,9,0,{"$f":"H433*Eingabe!$C$11/12","v":0},0,0,0,0,0]
[null,null,null,0,35,35,10,0,{"$f":"H434*Eingabe!$C$11/12","v":0},0,0,0,0,0]
[null,null,null,0,35,35,11,0,{"$f":"H435*Eingabe!$C$11/12","v":0},0,0,0,0,0]
[null,null,null,0,36,35,12,0,{"$f":"H436*Eingabe!$C$11/12","v":0},0,0,0,0,0]
[null,null,null,0,36,36,1,0,{"$f":"H437*Eingabe!$C$11/12","v":0},0,0,0,0,0]
[null,null,null,0,36,36,2,0,{"$f":"H438*Eingabe!$C$11/12","v":0},0,0,0,0,0]
[null,null,null,0,36,36,3,0,{"$f":"H439*Eingabe!$C$11/12","v":0},0,0,0,0,0]
[null,null,null,0,36,36,4,0,{"$f":"H440*Eingabe!$C$11/12","v":0},0,0,0,0,0]
[null,null,null,0,36,36,5,0,{"$f":"H441*Eingabe!$C$11/12","v":0},0,0,0,0,0]
[null,null,null,0,36,36,6,0,{"$f":"H442*Eingabe!$C$11/12","v":0},0,0,0,0,0]
[null,null,null,0,36,36,7,0,{"$f":"H443*Eingabe!$C$11/12","v":0},0,0,0,0,0]
[null,null,null,0,36,36,8,0,{"$f":"H444*Eingabe!$C$11/12","v":0},0,0,0,0,0]
[null,null,null,0,36,36,9,0,{"$f":"H445*Eingabe!$C$11/12","v":0},0,0,0,0,0]
[null,null,null,0,36,36,10,0,{"$f":"H446*Eingabe!$C$11/12","v":0},0,0,0,0,0]
[null,null,null,0,36,36,11,0,{"$f":"H447*Eingabe!$C$11/12","v":0},0,0,0,0,0]
[null,null,null,0,37,36,12,0,{"$f":"H448*Eingabe!$C$11/12","v":0},0,0,0,0,0]
[null,null,null,0,37,37,1,0,{"$f":"H449*Eingabe!$C$11/12","v":0},0,0,0,0,0]
[null,null,null,0,37,37,2,0,{"$f":"H450*Eingabe!$C$11/12","v":0},0,0,0,0,0]
[null,null,null,0,37,37,3,0,{"$f":"H451*Eingabe!$C$11/12","v":0},0,0,0,0,0]
[null,null,null,0,37,37,4,0,{"$f":"H452*Eingabe!$C$11/12","v":0},0,0,0,0,0]
[null,null,null,{"$f":"IF(AND(M453=0,M452>0),1,0)","v":0},37,37,5,0,{"$f":"H453*Eingabe!$C$11/12","v":0},0,0,0,0,0]
[null,null,null,0,37,37,6,0,{"$f":"H454*Eingabe!$C$11/12","v":0},{"$f":"IF(H454=0,0,J453)","v":0},0,0,{"$f":"IF(H454-K454<=0,0,H454-K454)","v":0},{"$f":"IF(G454=1,I454,I454+N453)","v":0}]
[null,null,null,0,{"$f":"IF(G455=12,1+E454,E454)","v":37},37,7,{"$f":"M454","v":0},{"$f":"H455*Eingabe!$C$11/12","v":0},0,{"$f":"J455-I455","v":0},{"$f":"I455+K455","v":0},0,0]
[null,null,null,0,37,37,8,0,{"$f":"H456*Eingabe!$C$11/12","v":0},0,0,0,0,0]
[null,null,null,0,37,37,9,0,{"$f":"H457*Eingabe!$C$11/12","v":0},0,0,0,0,0]
[null,null,null,0,37,37,10,0,{"$f":"H458*Eingabe!$C$11/12","v":0},0,0,0,0,0]
[null,null,null,0,37,37,11,0,{"$f":"H459*Eingabe!$C$11/12","v":0},0,0,0,0,0]
[null,null,null,0,38,37,12,0,{"$f":"H460*Eingabe!$C$11/12","v":0},0,0,0,0,0]
[null,null,null,0,38,38,1,0,{"$f":"H461*Eingabe!$C$11/12","v":0},0,0,0,0,0]
[null,null,null,0,38,38,{"$f":"IF(G461+1=13,1,G461+1)","v":2},0,{"$f":"H462*Eingabe!$C$11/12","v":0},0,0,0,0,0]
[null,null,null,0,38,38,3,0,{"$f":"H463*Eingabe!$C$11/12","v":0},0,0,0,0,0]
[null,null,null,0,38,38,4,0,{"$f":"H464*Eingabe!$C$11/12","v":0},0,0,0,0,0]
[null,null,null,0,38,38,5,0,{"$f":"H465*Eingabe!$C$11/12","v":0},0,0,0,0,0]
[null,null,null,0,38,38,6,0,{"$f":"H466*Eingabe!$C$11/12","v":0},0,0,0,0,0]
[null,null,null,0,38,38,7,0,{"$f":"H467*Eingabe!$C$11/12","v":0},0,0,0,0,0]
[null,null,null,0,38,38,8,0,{"$f":"H468*Eingabe!$C$11/12","v":0},0,0,0,0,0]
[null,null,null,0,38,38,9,0,{"$f":"H469*Eingabe!$C$11/12","v":0},0,0,0,0,0]
[null,null,null,0,38,38,10,0,{"$f":"H470*Eingabe!$C$11/12","v":0},0,0,0,0,0]
[null,null,null,0,38,38,11,0,{"$f":"H471*Eingabe!$C$11/12","v":0},0,0,0,0,0]
[null,null,null,0,39,38,12,0,{"$f":"H472*Eingabe!$C$11/12","v":0},0,0,0,0,0]
[null,null,null,0,39,39,1,0,{"$f":"H473*Eingabe!$C$11/12","v":0},0,0,0,0,0]
[null,null,null,0,39,39,2,0,{"$f":"H474*Eingabe!$C$11/12","v":0},0,0,0,0,0]
[null,null,null,0,39,39,3,0,{"$f":"H475*Eingabe!$C$11/12","v":0},0,0,0,0,0]
[null,null,null,0,39,39,4,0,{"$f":"H476*Eingabe!$C$11/12","v":0},0,0,0,0,0]
[null,null,null,0,39,39,5,0,{"$f":"H477*Eingabe!$C$11/12","v":0},0,0,0,0,0]
[null,null,null,0,39,39,6,0,{"$f":"H478*Eingabe!$C$11/12","v":0},0,0,0,0,0]
[null,null,null,0,39,39,7,0,{"$f":"H479*Eingabe!$C$11/12","v":0},0,0,0,0,0]
[null,null,null,0,39,39,8,0,{"$f":"H480*Eingabe!$C$11/12","v":0},0,0,0,0,0]
[null,null,null,0,39,39,9,0,{"$f":"H481*Eingabe!$C$11/12","v":0},0,0,0,0,0]
[null,null,null,0,39,39,10,0,{"$f":"H482*Eingabe!$C$11/12","v":0},0,0,0,0,0]
[null,null,null,0,39,39,11,0,{"$f":"H483*Eingabe!$C$11/12","v":0},0,0,0,0,0]
[null,null,null,0,40,39,12,0,{"$f":"H484*Eingabe!$C$11/12","v":0},0,0,0,0,0]
[null,null,null,0,40,40,1,0,{"$f":"H485*Eingabe!$C$11/12","v":0},0,0,0,0,0]
[null,null,null,0,40,40,2,0,{"$f":"H486*Eingabe!$C$11/12","v":0},0,0,0,0,0]
[null,null,null,0,40,40,3,0,{"$f":"H487*Eingabe!$C$11/12","v":0},0,0,0,0,0]
[null,null,null,0,40,40,4,0,{"$f":"H488*Eingabe!$C$11/12","v":0},0,0,0,0,0]
[null,null,null,0,40,40,5,0,{"$f":"H489*Eingabe!$C$11/12","v":0},0,0,0,0,0]
[null,null,null,0,40,40,6,0,{"$f":"H490*Eingabe!$C$11/12","v":0},0,0,0,0,0]
[null,null,null,0,40,40,7,0,{"$f":"H491*Eingabe!$C$11/12","v":0},0,0,0,0,0]
[null,null,null,0,40,40,8,0,{"$f":"H492*Eingabe!$C$11/12","v":0},0,0,0,0,0]
[null,null,null,0,40,40,9,0,{"$f":"H493*Eingabe!$C$11/12","v":0},0,0,0,0,0]
[null,null,null,0,40,40,10,0,{"$f":"H494*Eingabe!$C$11/12","v":0},0,0,0,0,0]
[null,null,null,0,40,40,11,0,{"$f":"H495*Eingabe!$C$11/12","v":0},0,0,0,0,0]
[null,null,null,0,41,40,12,0,{"$f":"H496*Eingabe!$C$11/12","v":0},0,0,0,0,0]
[null,null,null,0,41,41,1,0,{"$f":"H497*Eingabe!$C$11/12","v":0},0,0,0,0,0]
[null,null,null,0,41,41,2,0,{"$f":"H498*Eingabe!$C$11/12","v":0},0,0,0,0,0]
[null,null,null,0,41,41,3,0,{"$f":"H499*Eingabe!$C$11/12","v":0},0,0,0,0,0]
[null,null,null,0,41,41,4,0,{"$f":"H500*Eingabe!$C$11/12","v":0},0,0,0,0,0]
[null,null,null,0,41,41,5,0,{"$f":"H501*Eingabe!$C$11/12","v":0},0,0,0,0,0]
[null,null,null,0,41,41,6,0,{"$f":"H502*Eingabe!$C$11/12","v":0},0,0,0,0,0]
[null,null,null,0,41,41,7,0,{"$f":"H503*Eingabe!$C$11/12","v":0},0,0,0,0,0]
[null,null,null,0,41,41,8,0,{"$f":"H504*Eingabe!$C$11/12","v":0},0,0,0,0,0]
[null,null,null,0,41,41,9,0,{"$f":"H505*Eingabe!$C$11/12","v":0},0,0,0,0,0]
[null,null,null,0,41,41,10,0,{"$f":"H506*Eingabe!$C$11/12","v":0},0,0,0,0,0]
[null,null,null,0,41,41,11,0,{"$f":"H507*Eingabe!$C$11/12","v":0},0,0,0,0,0]
[null,null,null,0,42,41,12,0,{"$f":"H508*Eingabe!$C$11/12","v":0},0,0,0,0,0]
[null,null,null,0,42,42,1,0,{"$f":"H509*Eingabe!$C$11/12","v":0},0,0,0,0,0]
[null,null,null,0,42,42,2,0,{"$f":"H510*Eingabe!$C$11/12","v":0},0,0,0,0,0]
[null,null,null,0,42,42,3,0,{"$f":"H511*Eingabe!$C$11/12","v":0},0,0,0,0,0]
[null,null,null,0,42,42,4,0,{"$f":"H512*Eingabe!$C$11/12","v":0},0,0,0,0,0]
[null,null,null,0,42,42,5,0,{"$f":"H513*Eingabe!$C$11/12","v":0},0,0,0,0,0]
[null,null,null,0,42,42,6,0,{"$f":"H514*Eingabe!$C$11/12","v":0},0,0,0,0,0]
[null,null,null,0,42,42,7,0,{"$f":"H515*Eingabe!$C$11/12","v":0},0,0,0,0,0]
[null,null,null,0,42,42,8,0,{"$f":"H516*Eingabe!$C$11/12","v":0},0,0,0,0,0]
[null,null,null,{"$f":"IF(AND(M517=0,M516>0),1,0)","v":0},42,42,9,0,{"$f":"H517*Eingabe!$C$11/12","v":0},0,0,0,0,0]
[null,null,null,0,42,42,10,0,{"$f":"H518*Eingabe!$C$11/12","v":0},{"$f":"IF(H518=0,0,J517)","v":0},0,0,{"$f":"IF(H518-K518<=0,0,H518-K518)","v":0},{"$f":"IF(G518=1,I518,I518+N517)","v":0}]
[null,null,null,0,{"$f":"IF(G519=12,1+E518,E518)","v":42},42,11,{"$f":"M518","v":0},{"$f":"H519*Eingabe!$C$11/12","v":0},0,{"$f":"J519-I519","v":0},{"$f":"I519+K519","v":0},0,0]
[null,null,null,0,43,42,12,0,{"$f":"H520*Eingabe!$C$11/12","v":0},0,0,0,0,0]
[null,null,null,0,43,43,1,0,{"$f":"H521*Eingabe!$C$11/12","v":0},0,0,0,0,0]
[null,null,null,0,43,43,2,0,{"$f":"H522*Eingabe!$C$11/12","v":0},0,0,0,0,0]
[null,null,null,0,43,43,3,0,{"$f":"H523*Eingabe!$C$11/12","v":0},0,0,0,0,0]
[null,null,null,0,43,43,4,0,{"$f":"H524*Eingabe!$C$11/12","v":0},0,0,0,0,0]
[null,null,null,0,43,43,5,0,{"$f":"H525*Eingabe!$C$11/12","v":0},0,0,0,0,0]
[null,null,null,0,43,43,{"$f":"IF(G525+1=13,1,G525+1)","v":6},0,{"$f":"H526*Eingabe!$C$11/12","v":0},0,0,0,0,0]
[null,null,null,0,43,43,7,0,{"$f":"H527*Eingabe!$C$11/12","v":0},0,0,0,0,0]
[null,null,null,0,43,43,8,0,{"$f":"H528*Eingabe!$C$11/12","v":0},0,0,0,0,0]
[null,null,null,0,43,43,9,0,{"$f":"H529*Eingabe!$C$11/12","v":0},0,0,0,0,0]
[null,null,null,0,43,43,10,0,{"$f":"H530*Eingabe!$C$11/12","v":0},0,0,0,0,0]
[null,null,null,0,43,43,11,0,{"$f":"H531*Eingabe!$C$11/12","v":0},0,0,0,0,0]
[null,null,null,0,44,43,12,0,{"$f":"H532*Eingabe!$C$11/12","v":0},0,0,0,0,0]
[null,null,null,0,44,44,1,0,{"$f":"H533*Eingabe!$C$11/12","v":0},0,0,0,0,0]
[null,null,null,0,44,44,2,0,{"$f":"H534*Eingabe!$C$11/12","v":0},0,0,0,0,0]
[null,null,null,0,44,44,3,0,{"$f":"H535*Eingabe!$C$11/12","v":0},0,0,0,0,0]
[null,null,null,0,44,44,4,0,{"$f":"H536*Eingabe!$C$11/12","v":0},0,0,0,0,0]
[null,null,null,0,44,44,5,0,{"$f":"H537*Eingabe!$C$11/12","v":0},0,0,0,0,0]
[null,null,null,0,44,44,6,0,{"$f":"H538*Eingabe!$C$11/12","v":0},0,0,0,0,0]
[null,null,null,0,44,44,7,0,{"$f":"H539*Eingabe!$C$11/12","v":0},0,0,0,0,0]
[null,null,null,0,44,44,8,0,{"$f":"H540*Eingabe!$C$11/12","v":0},0,0,0,0,0]
[null,null,null,0,44,44,9,0,{"$f":"H541*Eingabe!$C$11/12","v":0},0,0,0,0,0]
[null,null,null,0,44,44,10,0,{"$f":"H542*Eingabe!$C$11/12","v":0},0,0,0,0,0]
[null,null,null,0,44,44,11,0,{"$f":"H543*Eingabe!$C$11/12","v":0},0,0,0,0,0]
[null,null,null,0,45,44,12,0,{"$f":"H544*Eingabe!$C$11/12","v":0},0,0,0,0,0]
[null,null,null,0,45,45,1,0,{"$f":"H545*Eingabe!$C$11/12","v":0},0,0,0,0,0]
[null,null,null,0,45,45,2,0,{"$f":"H546*Eingabe!$C$11/12","v":0},0,0,0,0,0]
[null,null,null,0,45,45,3,0,{"$f":"H547*Eingabe!$C$11/12","v":0},0,0,0,0,0]
[null,null,null,0,45,45,4,0,{"$f":"H548*Eingabe!$C$11/12","v":0},0,0,0,0,0]
[null,null,null,0,45,45,5,0,{"$f":"H549*Eingabe!$C$11/12","v":0},0,0,0,0,0]
[null,null,null,0,45,45,6,0,{"$f":"H550*Eingabe!$C$11/12","v":0},0,0,0,0,0]
[null,null,null,0,45,45,7,0,{"$f":"H551*Eingabe!$C$11/12","v":0},0,0,0,0,0]
[null,null,null,0,45,45,8,0,{"$f":"H552*Eingabe!$C$11/12","v":0},0,0,0,0,0]
[null,null,null,0,45,45,9,0,{"$f":"H553*Eingabe!$C$11/12","v":0},0,0,0,0,0]
[null,null,null,0,45,45,10,0,{"$f":"H554*Eingabe!$C$11/12","v":0},0,0,0,0,0]
[null,null,null,0,45,45,11,0,{"$f":"H555*Eingabe!$C$11/12","v":0},0,0,0,0,0]
[null,null,null,0,46,45,12,0,{"$f":"H556*Eingabe!$C$11/12","v":0},0,0,0,0,0]
[null,null,null,0,46,46,1,0,{"$f":"H557*Eingabe!$C$11/12","v":0},0,0,0,0,0]
[null,null,null,0,46,46,2,0,{"$f":"H558*Eingabe!$C$11/12","v":0},0,0,0,0,0]
[null,null,null,0,46,46,3,0,{"$f":"H559*Eingabe!$C$11/12","v":0},0,0,0,0,0]
[null,null,null,0,46,46,4,0,{"$f":"H560*Eingabe!$C$11/12","v":0},0,0,0,0,0]
[null,null,null,0,46,46,5,0,{"$f":"H561*Eingabe!$C$11/12","v":0},0,0,0,0,0]
[null,null,null,0,46,46,6,0,{"$f":"H562*Eingabe!$C$11/12","v":0},0,0,0,0,0]
[null,null,null,0,46,46,7,0,{"$f":"H563*Eingabe!$C$11/12","v":0},0,0,0,0,0]
[null,null,null,0,46,46,8,0,{"$f":"H564*Eingabe!$C$11/12","v":0},0,0,0,0,0]
[null,null,null,0,46,46,9,0,{"$f":"H565*Eingabe!$C$11/12","v":0},0,0,0,0,0]
[null,null,null,0,46,46,10,0,{"$f":"H566*Eingabe!$C$11/12","v":0},0,0,0,0,0]
[null,null,null,0,46,46,11,0,{"$f":"H567*Eingabe!$C$11/12","v":0},0,0,0,0,0]
[null,null,null,0,47,46,12,0,{"$f":"H568*Eingabe!$C$11/12","v":0},0,0,0,0,0]
[null,null,null,0,47,47,1,0,{"$f":"H569*Eingabe!$C$11/12","v":0},0,0,0,0,0]
[null,null,null,0,47,47,2,0,{"$f":"H570*Eingabe!$C$11/12","v":0},0,0,0,0,0]
[null,null,null,0,47,47,3,0,{"$f":"H571*Eingabe!$C$11/12","v":0},0,0,0,0,0]
[null,null,null,0,47,47,4,0,{"$f":"H572*Eingabe!$C$11/12","v":0},0,0,0,0,0]
[null,null,null,0,47,47,5,0,{"$f":"H573*Eingabe!$C$11/12","v":0},0,0,0,0,0]
[null,null,null,0,47,47,6,0,{"$f":"H574*Eingabe!$C$11/12","v":0},0,0,0,0,0]
[null,null,null,0,47,47,7,0,{"$f":"H575*Eingabe!$C$11/12","v":0},0,0,0,0,0]
[null,null,null,0,47,47,8,0,{"$f":"H576*Eingabe!$C$11/12","v":0},0,0,0,0,0]
[null,null,null,0,47,47,9,0,{"$f":"H577*Eingabe!$C$11/12","v":0},0,0,0,0,0]
[null,null,null,0,47,47,10,0,{"$f":"H578*Eingabe!$C$11/12","v":0},0,0,0,0,0]
[null,null,null,0,47,47,11,0,{"$f":"H579*Eingabe!$C$11/12","v":0},0,0,0,0,0]
[null,null,null,0,48,47,12,0,{"$f":"H580*Eingabe!$C$11/12","v":0},0,0,0,0,0]
[null,null,null,{"$f":"IF(AND(M581=0,M580>0),1,0)","v":0},48,48,1,0,{"$f":"H581*Eingabe!$C$11/12","v":0},0,0,0,0,0]
[null,null,null,0,48,48,2,0,{"$f":"H582*Eingabe!$C$11/12","v":0},{"$f":"IF(H582=0,0,J581)","v":0},0,0,{"$f":"IF(H582-K582<=0,0,H582-K582)","v":0},{"$f":"IF(G582=1,I582,I582+N581)","v":0}]
[null,null,null,0,{"$f":"IF(G583=12,1+E582,E582)","v":48},48,3,{"$f":"M582","v":0},{"$f":"H583*Eingabe!$C$11/12","v":0},0,{"$f":"J583-I583","v":0},{"$f":"I583+K583","v":0},0,0]
[null,null,null,0,48,48,4,0,{"$f":"H584*Eingabe!$C$11/12","v":0},0,0,0,0,0]
[null,null,null,0,48,48,5,0,{"$f":"H585*Eingabe!$C$11/12","v":0},0,0,0,0,0]
[null,null,null,0,48,48,6,0,{"$f":"H586*Eingabe!$C$11/12","v":0},0,0,0,0,0]
[null,null,null,0,48,48,7,0,{"$f":"H587*Eingabe!$C$11/12","v":0},0,0,0,0,0]
[null,null,null,0,48,48,8,0,{"$f":"H588*Eingabe!$C$11/12","v":0},0,0,0,0,0]
[null,null,null,0,48,48,9,0,{"$f":"H589*Eingabe!$C$11/12","v":0},0,0,0,0,0]
[null,null,null,0,48,48,{"$f":"IF(G589+1=13,1,G589+1)","v":10},0,{"$f":"H590*Eingabe!$C$11/12","v":0},0,0,0,0,0]
[null,null,null,0,48,48,11,0,{"$f":"H591*Eingabe!$C$11/12","v":0},0,0,0,0,0]
[null,null,null,0,49,48,12,0,{"$f":"H592*Eingabe!$C$11/12","v":0},0,0,0,0,0]
[null,null,null,0,49,49,1,0,{"$f":"H593*Eingabe!$C$11/12","v":0},0,0,0,0,0]
[null,null,null,0,49,49,2,0,{"$f":"H594*Eingabe!$C$11/12","v":0},0,0,0,0,0]
[null,null,null,0,49,49,3,0,{"$f":"H595*Eingabe!$C$11/12","v":0},0,0,0,0,0]
[null,null,null,0,49,49,4,0,{"$f":"H596*Eingabe!$C$11/12","v":0},0,0,0,0,0]
[null,null,null,0,49,49,5,0,{"$f":"H597*Eingabe!$C$11/12","v":0},0,0,0,0,0]
[null,null,null,0,49,49,6,0,{"$f":"H598*Eingabe!$C$11/12","v":0},0,0,0,0,0]
[null,null,null,0,49,49,7,0,{"$f":"H599*Eingabe!$C$11/12","v":0},0,0,0,0,0]
[null,null,null,0,49,49,8,0,{"$f":"H600*Eingabe!$C$11/12","v":0},0,0,0,0,0]
[null,null,null,0,49,49,9,0,{"$f":"H601*Eingabe!$C$11/12","v":0},0,0,0,0,0]
[null,null,null,0,49,49,10,0,{"$f":"H602*Eingabe!$C$11/12","v":0},0,0,0,0,0]
[null,null,null,0,49,49,11,0,{"$f":"H603*Eingabe!$C$11/12","v":0},0,0,0,0,0]
[null,null,null,0,50,49,12,0,{"$f":"H604*Eingabe!$C$11/12","v":0},0,0,0,0,0]
[null,null,null,0,50,50,1,{"$f":"M604","v":0},{"$f":"H605*Eingabe!$C$11/12","v":0},0,{"$f":"J605-I605","v":0},{"$f":"I605+K605","v":0},0,0]
[null,null,null,0,50,50,2,0,{"$f":"H606*Eingabe!$C$11/12","v":0},0,0,0,0,0]
[null,null,null,0,50,50,3,{"$f":"M606","v":0},{"$f":"H607*Eingabe!$C$11/12","v":0},0,{"$f":"J607-I607","v":0},{"$f":"I607+K607","v":0},0,0]
[null,null,null,0,50,50,4,0,{"$f":"H608*Eingabe!$C$11/12","v":0},0,0,0,0,0]
[null,null,null,0,50,50,5,0,{"$f":"H609*Eingabe!$C$11/12","v":0},0,0,0,0,0]
[null,null,null,0,50,50,6,0,{"$f":"H610*Eingabe!$C$11/12","v":0},0,0,0,0,0]
[null,null,null,0,50,50,7,0,{"$f":"H611*Eingabe!$C$11/12","v":0},0,0,0,0,0]
[null,null,null,0,50,50,8,0,{"$f":"H612*Eingabe!$C$11/12","v":0},0,0,0,0,0]
[null,null,null,0,50,50,9,0,{"$f":"H613*Eingabe!$C$11/12","v":0},0,0,0,0,0]
[null,null,null,0,50,50,10,0,{"$f":"H614*Eingabe!$C$11/12","v":0},0,0,0,0,0]
[null,null,null,0,50,50,11,0,{"$f":"H615*Eingabe!$C$11/12","v":0},0,0,0,0,0]
[null,null,null,0,51,50,12,0,{"$f":"H616*Eingabe!$C$11/12","v":0},0,0,0,0,0]
[null,null,null,0,51,51,1,0,{"$f":"H617*Eingabe!$C$11/12","v":0},0,0,0,0,0]
[null,null,null,0,51,51,2,0,{"$f":"H618*Eingabe!$C$11/12","v":0},0,0,0,0,0]
[null,null,null,0,51,51,3,0,{"$f":"H619*Eingabe!$C$11/12","v":0},0,0,0,0,0]
[null,null,null,0,51,51,4,0,{"$f":"H620*Eingabe!$C$11/12","v":0},0,0,0,0,0]
[null,null,null,0,51,51,5,0,{"$f":"H621*Eingabe!$C$11/12","v":0},0,0,0,0,0]
[null,null,null,0,51,51,6,0,{"$f":"H622*Eingabe!$C$11/12","v":0},0,0,0,0,0]
[null,null,null,0,51,51,7,0,{"$f":"H623*Eingabe!$C$11/12","v":0},0,0,0,0,0]
[null,null,null,0,51,51,8,0,{"$f":"H624*Eingabe!$C$11/12","v":0},0,0,0,0,0]
[null,null,null,0,51,51,9,0,{"$f":"H625*Eingabe!$C$11/12","v":0},0,0,0,0,0]
[null,null,null,0,51,51,10,{"$f":"M625","v":0},{"$f":"H626*Eingabe!$C$11/12","v":0},0,{"$f":"J626-I626","v":0},{"$f":"I626+K626","v":0},0,0]
[null,null,null,0,51,51,11,0,{"$f":"H627*Eingabe!$C$11/12","v":0},0,0,0,0,0]
[null,null,null,0,52,51,12,0,{"$f":"H628*Eingabe!$C$11/12","v":0},0,0,0,0,0]
[null,null,null,{"$f":"IF(AND(M629=0,M628>0),1,0)","v":0},52,52,1,{"$f":"M628","v":0},{"$f":"H629*Eingabe!$C$11/12","v":0},0,{"$f":"J629-I629","v":0},{"$f":"I629+K629","v":0},0,0]
[null,null,null,0,52,52,2,0,{"$f":"H630*Eingabe!$C$11/12","v":0},0,0,0,0,0]
[null,null,null,0,52,52,3,0,{"$f":"H631*Eingabe!$C$11/12","v":0},0,0,0,0,0]
[null,null,null,0,52,52,4,0,{"$f":"H632*Eingabe!$C$11/12","v":0},0,0,0,0,0]
[null,null,null,0,52,52,5,0,{"$f":"H633*Eingabe!$C$11/12","v":0},0,0,0,0,0]
[null,null,null,0,52,52,6,0,{"$f":"H634*Eingabe!$C$11/12","v":0},0,0,0,0,0]
[null,null,null,0,52,52,7,0,{"$f":"H635*Eingabe!$C$11/12","v":0},0,0,0,0,0]
[null,null,null,0,52,52,8,0,{"$f":"H636*Eingabe!$C$11/12","v":0},0,0,0,0,0]
[null,null,null,0,52,52,9,0,{"$f":"H637*Eingabe!$C$11/12","v":0},0,0,0,0,0]
[null,null,null,0,52,52,10,0,{"$f":"H638*Eingabe!$C$11/12","v":0},0,0,0,0,0]
[null,null,null,0,52,52,11,0,{"$f":"H639*Eingabe!$C$11/12","v":0},0,0,0,0,0]
[null,null,null,0,53,52,12,0,{"$f":"H640*Eingabe!$C$11/12","v":0},0,0,0,0,0]
[null,null,null,0,53,53,1,0,{"$f":"H641*Eingabe!$C$11/12","v":0},0,0,0,0,0]
[null,null,null,0,53,53,2,0,{"$f":"H642*Eingabe!$C$11/12","v":0},0,0,0,0,0]
[null,null,null,0,53,53,3,0,{"$f":"H643*Eingabe!$C$11/12","v":0},0,0,0,0,0]
[null,null,null,0,53,53,4,0,{"$f":"H644*Eingabe!$C$11/12","v":0},0,0,0,0,0]
[null,null,null,0,53,53,5,0,{"$f":"H645*Eingabe!$C$11/12","v":0},0,0,0,0,0]
[null,null,null,0,53,53,6,0,{"$f":"H646*Eingabe!$C$11/12","v":0},{"$f":"IF(H646=0,0,J645)","v":0},0,0,{"$f":"IF(H646-K646<=0,0,H646-K646)","v":0},{"$f":"IF(G646=1,I646,I646+N645)","v":0}]
[null,null,null,0,{"$f":"IF(G647=12,1+E646,E646)","v":53},53,7,0,{"$f":"H647*Eingabe!$C$11/12","v":0},0,0,0,0,0]
[null,null,null,0,53,53,8,0,{"$f":"H648*Eingabe!$C$11/12","v":0},0,0,0,0,0]
[null,null,null,0,53,53,9,0,{"$f":"H649*Eingabe!$C$11/12","v":0},0,0,0,0,0]
[null,null,null,0,53,53,10,0,{"$f":"H650*Eingabe!$C$11/12","v":0},0,0,0,0,0]
[null,null,null,0,53,53,11,0,{"$f":"H651*Eingabe!$C$11/12","v":0},0,0,0,0,0]
[null,null,null,0,54,53,12,0,{"$f":"H652*Eingabe!$C$11/12","v":0},0,0,0,0,0]
[null,null,null,0,54,54,1,0,{"$f":"H653*Eingabe!$C$11/12","v":0},0,0,0,0,0]
[null,null,null,0,54,54,{"$f":"IF(G653+1=13,1,G653+1)","v":2},0,{"$f":"H654*Eingabe!$C$11/12","v":0},0,0,0,0,0]
[null,null,null,0,54,54,3,0,{"$f":"H655*Eingabe!$C$11/12","v":0},0,0,0,0,0]
[null,null,null,0,54,54,4,0,{"$f":"H656*Eingabe!$C$11/12","v":0},0,0,0,0,0]
[null,null,null,0,54,54,5,0,{"$f":"H657*Eingabe!$C$11/12","v":0},0,0,0,0,0]
[null,null,null,0,54,54,6,0,{"$f":"H658*Eingabe!$C$11/12","v":0},0,0,0,0,0]
[null,null,null,0,54,54,7,0,{"$f":"H659*Eingabe!$C$11/12","v":0},0,0,0,0,0]
[null,null,null,0,54,54,8,0,{"$f":"H660*Eingabe!$C$11/12","v":0},0,0,0,0,0]
[null,null,null,0,54,54,9,0,{"$f":"H661*Eingabe!$C$11/12","v":0},0,0,0,0,0]
[null,null,null,0,54,54,10,0,{"$f":"H662*Eingabe!$C$11/12","v":0},0,0,0,0,0]
[null,null,null,0,54,54,11,0,{"$f":"H663*Eingabe!$C$11/12","v":0},0,0,0,0,0]
[null,null,null,0,55,54,12,0,{"$f":"H664*Eingabe!$C$11/12","v":0},0,0,0,0,0]
[null,null,null,0,55,55,1,0,{"$f":"H665*Eingabe!$C$11/12","v":0},0,0,0,0,0]
[null,null,null,0,55,55,2,0,{"$f":"H666*Eingabe!$C$11/12","v":0},0,0,0,0,0]
[null,null,null,0,55,55,3,0,{"$f":"H667*Eingabe!$C$11/12","v":0},0,0,0,0,0]
[null,null,null,0,55,55,4,0,{"$f":"H668*Eingabe!$C$11/12","v":0},0,0,0,0,0]
[null,null,null,0,55,55,5,0,{"$f":"H669*Eingabe!$C$11/12","v":0},0,0,0,0,0]
[null,null,null,0,55,55,6,0,{"$f":"H670*Eingabe!$C$11/12","v":0},0,0,0,0,0]
[null,null,null,0,55,55,7,0,{"$f":"H671*Eingabe!$C$11/12","v":0},0,0,0,0,0]
[null,null,null,0,55,55,8,0,{"$f":"H672*Eingabe!$C$11/12","v":0},0,0,0,0,0]
[null,null,null,0,55,55,9,0,{"$f":"H673*Eingabe!$C$11/12","v":0},0,0,0,0,0]
[null,null,null,0,55,55,10,0,{"$f":"H674*Eingabe!$C$11/12","v":0},0,0,0,0,0]
[null,null,null,0,55,55,11,0,{"$f":"H675*Eingabe!$C$11/12","v":0},0,0,0,0,0]
[null,null,null,0,56,55,12,0,{"$f":"H676*Eingabe!$C$11/12","v":0},0,0,0,0,0]
[null,null,null,0,56,56,1,0,{"$f":"H677*Eingabe!$C$11/12","v":0},0,0,0,0,0]
[null,null,null,0,56,56,2,0,{"$f":"H678*Eingabe!$C$11/12","v":0},0,0,0,0,0]
[null,null,null,0,56,56,3,0,{"$f":"H679*Eingabe!$C$11/12","v":0},0,0,0,0,0]
[null,null,null,0,56,56,4,0,{"$f":"H680*Eingabe!$C$11/12","v":0},0,0,0,0,0]
[null,null,null,0,56,56,5,0,{"$f":"H681*Eingabe!$C$11/12","v":0},0,0,0,0,0]
[null,null,null,0,56,56,6,0,{"$f":"H682*Eingabe!$C$11/12","v":0},0,0,0,0,0]
[null,null,null,0,56,56,7,0,{"$f":"H683*Eingabe!$C$11/12","v":0},0,0,0,0,0]
[null,null,null,0,56,56,8,0,{"$f":"H684*Eingabe!$C$11/12","v":0},0,0,0,0,0]
[null,null,null,0,56,56,9,0,{"$f":"H685*Eingabe!$C$11/12","v":0},0,0,0,0,0]
[null,null,null,0,56,56,10,0,{"$f":"H686*Eingabe!$C$11/12","v":0},0,0,0,0,0]
[null,null,null,0,56,56,11,0,{"$f":"H687*Eingabe!$C$11/12","v":0},0,0,0,0,0]
[null,null,null,0,57,56,12,0,{"$f":"H688*Eingabe!$C$11/12","v":0},0,0,0,0,0]
[null,null,null,0,57,57,1,0,{"$f":"H689*Eingabe!$C$11/12","v":0},0,0,0,0,0]
[null,null,null,0,57,57,2,0,{"$f":"H690*Eingabe!$C$11/12","v":0},0,0,0,0,0]
[null,null,null,0,57,57,3,0,{"$f":"H691*Eingabe!$C$11/12","v":0},0,0,0,0,0]
[null,null,null,0,57,57,4,0,{"$f":"H692*Eingabe!$C$11/12","v":0},0,0,0,0,0]
[null,null,null,{"$f":"IF(AND(M693=0,M692>0),1,0)","v":0},57,57,5,{"$f":"M692","v":0},{"$f":"H693*Eingabe!$C$11/12","v":0},0,{"$f":"J693-I693","v":0},{"$f":"I693+K693","v":0},0,0]
[null,null,null,0,57,57,6,0,{"$f":"H694*Eingabe!$C$11/12","v":0},0,0,0,0,0]
[null,null,null,0,57,57,7,0,{"$f":"H695*Eingabe!$C$11/12","v":0},0,0,0,0,0]
[null,null,null,0,57,57,8,0,{"$f":"H696*Eingabe!$C$11/12","v":0},0,0,0,0,0]
[null,null,null,0,57,57,9,0,{"$f":"H697*Eingabe!$C$11/12","v":0},0,0,0,0,0]
[null,null,null,0,57,57,10,0,{"$f":"H698*Eingabe!$C$11/12","v":0},0,0,0,0,0]
[null,null,null,0,57,57,11,0,{"$f":"H699*Eingabe!$C$11/12","v":0},0,0,0,0,0]
[null,null,null,0,58,57,12,0,{"$f":"H700*Eingabe!$C$11/12","v":0},0,0,0,0,0]
[null,null,null,0,58,58,1,0,{"$f":"H701*Eingabe!$C$11/12","v":0},0,0,0,0,0]
[null,null,null,0,58,58,2,0,{"$f":"H702*Eingabe!$C$11/12","v":0},0,0,0,0,0]
[null,null,null,0,58,58,3,0,{"$f":"H703*Eingabe!$C$11/12","v":0},0,0,0,0,0]
[null,null,null,0,58,58,4,0,{"$f":"H704*Eingabe!$C$11/12","v":0},0,0,0,0,0]
[null,null,null,0,58,58,5,0,{"$f":"H705*Eingabe!$C$11/12","v":0},0,0,0,0,0]
[null,null,null,0,58,58,6,0,{"$f":"H706*Eingabe!$C$11/12","v":0},0,0,0,0,0]
[null,null,null,0,58,58,7,0,{"$f":"H707*Eingabe!$C$11/12","v":0},0,0,0,0,0]
[null,null,null,0,58,58,8,0,{"$f":"H708*Eingabe!$C$11/12","v":0},0,0,0,0,0]
[null,null,null,0,58,58,9,0,{"$f":"H709*Eingabe!$C$11/12","v":0},0,0,0,0,0]
[null,null,null,0,58,58,10,0,{"$f":"H710*Eingabe!$C$11/12","v":0},{"$f":"IF(H710=0,0,J709)","v":0},0,0,{"$f":"IF(H710-K710<=0,0,H710-K710)","v":0},{"$f":"IF(G710=1,I710,I710+N709)","v":0}]
[null,null,null,0,{"$f":"IF(G711=12,1+E710,E710)","v":58},58,11,0,{"$f":"H711*Eingabe!$C$11/12","v":0},0,0,0,0,0]
[null,null,null,0,59,58,12,0,{"$f":"H712*Eingabe!$C$11/12","v":0},0,0,0,0,0]
[null,null,null,0,59,59,1,0,{"$f":"H713*Eingabe!$C$11/12","v":0},0,0,0,0,0]
[null,null,null,0,59,59,2,0,{"$f":"H714*Eingabe!$C$11/12","v":0},0,0,0,0,0]
[null,null,null,0,59,59,3,0,{"$f":"H715*Eingabe!$C$11/12","v":0},0,0,0,0,0]
[null,null,null,0,59,59,4,0,{"$f":"H716*Eingabe!$C$11/12","v":0},0,0,0,0,0]
[null,null,null,0,59,59,5,0,{"$f":"H717*Eingabe!$C$11/12","v":0},0,0,0,0,0]
[null,null,null,0,59,59,{"$f":"IF(G717+1=13,1,G717+1)","v":6},0,{"$f":"H718*Eingabe!$C$11/12","v":0},0,0,0,0,0]
[null,null,null,0,59,59,7,0,{"$f":"H719*Eingabe!$C$11/12","v":0},0,0,0,0,0]
[null,null,null,0,59,59,8,0,{"$f":"H720*Eingabe!$C$11/12","v":0},0,0,0,0,0]
[null,null,null,0,59,59,9,0,{"$f":"H721*Eingabe!$C$11/12","v":0},0,0,0,0,0]
[null,null,null,0,59,59,10,0,{"$f":"H722*Eingabe!$C$11/12","v":0},0,0,0,0,0]
[null,null,null,0,59,59,11,0,{"$f":"H723*Eingabe!$C$11/12","v":0},0,0,0,0,0]
[null,null,null,0,60,59,12,0,{"$f":"H724*Eingabe!$C$11/12","v":0},0,0,0,0,0]
[null,null,null,0,60,60,1,0,{"$f":"H725*Eingabe!$C$11/12","v":0},0,0,0,0,0]
[null,null,null,0,60,60,2,0,{"$f":"H726*Eingabe!$C$11/12","v":0},0,0,0,0,0]
[null,null,null,0,60,60,3,0,{"$f":"H727*Eingabe!$C$11/12","v":0},0,0,0,0,0]
[null,null,null,0,60,60,4,0,{"$f":"H728*Eingabe!$C$11/12","v":0},0,0,0,0,0]
[null,null,null,0,60,60,5,0,{"$f":"H729*Eingabe!$C$11/12","v":0},0,0,0,0,0]
[null,null,null,0,60,60,6,0,{"$f":"H730*Eingabe!$C$11/12","v":0},0,0,0,0,0]
[null,null,null,0,60,60,7,0,{"$f":"H731*Eingabe!$C$11/12","v":0},0,0,0,0,0]
[null,null,null,0,60,60,8,0,{"$f":"H732*Eingabe!$C$11/12","v":0},0,0,0,0,0]
[null,null,null,0,60,60,9,0,{"$f":"H733*Eingabe!$C$11/12","v":0},0,0,0,0,0]
[null,null,null,0,60,60,10,0,{"$f":"H734*Eingabe!$C$11/12","v":0},0,0,0,0,0]
[null,null,null,0,60,60,11,0,{"$f":"H735*Eingabe!$C$11/12","v":0},0,0,0,0,0]
[null,null,null,0,61,60,12,0,{"$f":"H736*Eingabe!$C$11/12","v":0},0,0,0,0,0]
[null,null,null,0,61,61,1,0,{"$f":"H737*Eingabe!$C$11/12","v":0},0,0,0,0,0]
[null,null,null,0,61,61,2,0,{"$f":"H738*Eingabe!$C$11/12","v":0},0,0,0,0,0]
[null,null,null,0,61,61,3,0,{"$f":"H739*Eingabe!$C$11/12","v":0},0,0,0,0,0]
[null,null,null,0,61,61,4,0,{"$f":"H740*Eingabe!$C$11/12","v":0},0,0,0,0,0]
[null,null,null,0,61,61,5,0,{"$f":"H741*Eingabe!$C$11/12","v":0},0,0,0,0,0]
[null,null,null,0,61,61,6,0,{"$f":"H742*Eingabe!$C$11/12","v":0},0,0,0,0,0]
[null,null,null,0,61,61,7,0,{"$f":"H743*Eingabe!$C$11/12","v":0},0,0,0,0,0]
[null,null,null,0,61,61,8,0,{"$f":"H744*Eingabe!$C$11/12","v":0},0,0,0,0,0]
[null,null,null,0,61,61,9,0,{"$f":"H745*Eingabe!$C$11/12","v":0},0,0,0,0,0]
[null,null,null,0,61,61,10,0,{"$f":"H746*Eingabe!$C$11/12","v":0},0,0,0,0,0]
[null,null,null,0,61,61,11,0,{"$f":"H747*Eingabe!$C$11/12","v":0},0,0,0,0,0]
[null,null,null,0,62,61,12,0,{"$f":"H748*Eingabe!$C$11/12","v":0},0,0,0,0,0]
[null,null,null,0,62,62,1,0,{"$f":"H749*Eingabe!$C$11/12","v":0},0,0,0,0,0]
[null,null,null,0,62,62,2,0,{"$f":"H750*Eingabe!$C$11/12","v":0},0,0,0,0,0]
[null,null,null,0,62,62,3,0,{"$f":"H751*Eingabe!$C$11/12","v":0},0,0,0,0,0]
[null,null,null,0,62,62,4,0,{"$f":"H752*Eingabe!$C$11/12","v":0},0,0,0,0,0]
[null,null,null,0,62,62,5,0,{"$f":"H753*Eingabe!$C$11/12","v":0},0,0,0,0,0]
[null,null,null,0,62,62,6,0,{"$f":"H754*Eingabe!$C$11/12","v":0},0,0,0,0,0]
[null,null,null,0,62,62,7,0,{"$f":"H755*Eingabe!$C$11/12","v":0},0,0,0,0,0]
[null,null,null,0,62,62,8,0,{"$f":"H756*Eingabe!$C$11/12","v":0},0,0,0,0,0]
[null,null,null,{"$f":"IF(AND(M757=0,M756>0),1,0)","v":0},62,62,9,{"$f":"M756","v":0},{"$f":"H757*Eingabe!$C$11/12","v":0},0,{"$f":"J757-I757","v":0},{"$f":"I757+K757","v":0},0,0]
[null,null,null,0,62,62,10,0,{"$f":"H758*Eingabe!$C$11/12","v":0},0,0,0,0,0]
[null,null,null,0,62,62,11,0,{"$f":"H759*Eingabe!$C$11/12","v":0},0,0,0,0,0]
[null,null,null,0,63,62,12,0,{"$f":"H760*Eingabe!$C$11/12","v":0},0,0,0,0,0]
[null,null,null,0,63,63,1,0,{"$f":"H761*Eingabe!$C$11/12","v":0},0,0,0,0,0]
[null,null,null,0,63,63,2,0,{"$f":"H762*Eingabe!$C$11/12","v":0},0,0,0,0,0]
[null,null,null,0,63,63,3,0,{"$f":"H763*Eingabe!$C$11/12","v":0},0,0,0,0,0]
[null,null,null,0,63,63,4,0,{"$f":"H764*Eingabe!$C$11/12","v":0},0,0,0,0,0]
[null,null,null,0,63,63,5,0,{"$f":"H765*Eingabe!$C$11/12","v":0},0,0,0,0,0]
[null,null,null,0,63,63,6,0,{"$f":"H766*Eingabe!$C$11/12","v":0},0,0,0,0,0]
[null,null,null,0,63,63,7,0,{"$f":"H767*Eingabe!$C$11/12","v":0},0,0,0,0,0]
[null,null,null,0,63,63,8,0,{"$f":"H768*Eingabe!$C$11/12","v":0},0,0,0,0,0]
[null,null,null,0,63,63,9,0,{"$f":"H769*Eingabe!$C$11/12","v":0},0,0,0,0,0]
[null,null,null,0,63,63,10,0,{"$f":"H770*Eingabe!$C$11/12","v":0},0,0,0,0,0]
[null,null,null,0,63,63,11,0,{"$f":"H771*Eingabe!$C$11/12","v":0},0,0,0,0,0]
[null,null,null,0,64,63,12,0,{"$f":"H772*Eingabe!$C$11/12","v":0},0,0,0,0,0]
[null,null,null,0,64,64,1,0,{"$f":"H773*Eingabe!$C$11/12","v":0},0,0,0,0,0]
[null,null,null,0,64,64,2,0,{"$f":"H774*Eingabe!$C$11/12","v":0},{"$f":"IF(H774=0,0,J773)","v":0},0,0,{"$f":"IF(H774-K774<=0,0,H774-K774)","v":0},{"$f":"IF(G774=1,I774,I774+N773)","v":0}]
[null,null,null,0,{"$f":"IF(G775=12,1+E774,E774)","v":64},64,3,0,{"$f":"H775*Eingabe!$C$11/12","v":0},0,0,0,0,0]
[null,null,null,0,64,64,4,0,{"$f":"H776*Eingabe!$C$11/12","v":0},0,0,0,0,0]
[null,null,null,0,64,64,5,0,{"$f":"H777*Eingabe!$C$11/12","v":0},0,0,0,0,0]
[null,null,null,0,64,64,6,0,{"$f":"H778*Eingabe!$C$11/12","v":0},0,0,0,0,0]
[null,null,null,0,64,64,7,0,{"$f":"H779*Eingabe!$C$11/12","v":0},0,0,0,0,0]
[null,null,null,0,64,64,8,0,{"$f":"H780*Eingabe!$C$11/12","v":0},0,0,0,0,0]
[null,null,null,0,64,64,9,0,{"$f":"H781*Eingabe!$C$11/12","v":0},0,0,0,0,0]
[null,null,null,0,64,64,{"$f":"IF(G781+1=13,1,G781+1)","v":10},0,{"$f":"H782*Eingabe!$C$11/12","v":0},0,0,0,0,0]
[null,null,null,0,64,64,11,0,{"$f":"H783*Eingabe!$C$11/12","v":0},0,0,0,0,0]
[null,null,null,0,65,64,12,0,{"$f":"H784*Eingabe!$C$11/12","v":0},0,0,0,0,0]
[null,null,null,0,65,65,1,0,{"$f":"H785*Eingabe!$C$11/12","v":0},0,0,0,0,0]
[null,null,null,0,65,65,2,0,{"$f":"H786*Eingabe!$C$11/12","v":0},0,0,0,0,0]
[null,null,null,0,65,65,3,0,{"$f":"H787*Eingabe!$C$11/12","v":0},0,0,0,0,0]
[null,null,null,0,65,65,4,0,{"$f":"H788*Eingabe!$C$11/12","v":0},0,0,0,0,0]
[null,null,null,0,65,65,5,0,{"$f":"H789*Eingabe!$C$11/12","v":0},0,0,0,0,0]
[null,null,null,0,65,65,6,0,{"$f":"H790*Eingabe!$C$11/12","v":0},0,0,0,0,0]
[null,null,null,0,65,65,7,0,{"$f":"H791*Eingabe!$C$11/12","v":0},0,0,0,0,0]
[null,null,null,0,65,65,8,0,{"$f":"H792*Eingabe!$C$11/12","v":0},0,0,0,0,0]
[null,null,null,0,65,65,9,0,{"$f":"H793*Eingabe!$C$11/12","v":0},0,0,0,0,0]
[null,null,null,0,65,65,10,0,{"$f":"H794*Eingabe!$C$11/12","v":0},0,0,0,0,0]
[null,null,null,0,65,65,11,0,{"$f":"H795*Eingabe!$C$11/12","v":0},0,0,0,0,0]
[null,null,null,{"$f":"IF(AND(M796=0,M795>0),1,0)","v":0},66,65,12,0,{"$f":"H796*Eingabe!$C$11/12","v":0},0,0,0,0,0]
[null,null,null,{"$f":"IF(AND(M797=0,M796>0),1,0)","v":0},{"$f":"IF(G797=12,1+E796,E796)","v":66},66,1]