{"text_format":"1","workbook":"xlsx","n_sheets":16,"sheets":["Eingabe","Druck","Variablen","Hilfe","Sicherheit","Schichtennavigator","Inflation","Inflation Berechnung","Ruhestandsplanung","Ruhestandsplanung Berechnung","Risikoklasse","Risikoklasse Berechnen","Sicherheit Ausgabe","Schichtennavigator Ausgabe","Schichtennavigator Berechnung","Ruhestandsplanung Ausgabe"],"not_rendered":{"charts":6,"images":6,"macros":1,"external_links":0,"defined_names":0,"comments":0,"pivot_tables":0},"unopened":[],"bounds":{"document_bytes":16777216,"sheet_cells":100000,"rows_first":2000,"rows_last":500,"rows_between":2000,"halvings":0,"cell_chars":16384,"cell_head_chars":4096},"cells_cut":0,"cells_raw":0,"read":"whole","date_system":"1900"}

{"sheet":"Eingabe","index":0,"n_rows":47,"n_cols":11,"rows_kept":47,"cut":false,"hidden":false,"merged":[[24,8,24,9],[25,8,25,9],[27,8,27,9],[26,8,26,9],[23,8,23,10],[32,0,32,3],[32,4,32,5],[7,4,7,5],[7,6,7,7],[8,0,8,1],[8,2,8,3],[23,0,23,3],[23,4,23,5],[22,4,22,5],[20,4,20,5],[18,0,18,3],[10,6,10,7],[14,4,14,5],[14,0,14,3],[3,0,3,7],[5,0,5,7],[7,0,7,1],[7,2,7,3],[9,2,9,3],[9,0,9,1],[9,6,9,7],[6,1,6,4],[46,0,46,7],[9,4,9,5],[12,0,12,3],[12,4,12,5],[12,6,12,7],[15,0,15,3],[26,0,26,3],[26,4,26,5],[29,0,29,3],[29,4,29,5],[15,4,15,5],[16,4,16,5],[17,4,17,5],[19,0,19,3],[20,0,20,3],[30,6,30,7],[12,8,14,11],[30,0,30,3],[13,0,13,3],[30,4,30,5],[13,4,13,5],[13,6,13,7],[27,0,27,3],[27,4,27,5],[26,6,26,7],[24,0,24,1],[29,6,29,7],[18,4,18,5],[19,4,19,5],[24,4,24,5],[16,0,16,3],[17,0,17,3]]}
[]
[]
[]
[{"$f":"IF(Variablen!B1=YEAR(TODAY()),\"Wieviel Sicherheit kann ich mir leisten?\",\"Tool ist abgelaufen!\")","v":"Wieviel Sicherheit kann ich mir leisten?"}]
[]
["Eingaben"]
[null,{"$f":"IF(C9>C10,\"ACHTUNG: Beginn Ruhestand!\",\"\")","v":""}]
["Vorname",null,"Max",null,"Nachname",null,"Mustermann"]
["Alter",null,10]
["Beginn Ruhestand",null,67,null,null,null,36000]
[null,null,null,null,null,null,{"$f":"G10/12","v":3000}]
[]
["Wunscheinkommen im Ruhestand (Brutto) ca.",null,null,null,0,null,{"$f":"IF(Variablen!B6=1,\"(z.B.: 80% = ca. \"&FIXED(Hilfe!B18*0.8/12,0)&\" EUR mtl.)\",\"(z.B.: 80% = ca. \"&FIXED(Hilfe!B22*0.8/12,0)&\" EUR mtl.)\")","v":"(z.B.: 80% = ca. 2.400 EUR mtl.)"},null,{"$f":"IF(OR(E13=0,E14=0),\"ACHTUNG: Bitte entweder Wunscheinkommen brutto ODER netto eingeben UND dann Button ''Wunscheinkommen befüllen'' drücken!\",\"\")","v":"ACHTUNG: Bitte entweder Wunscheinkommen brutto ODER netto eingeben UND dann Button ''Wunscheinkommen befüllen'' drücken!"}]
["Wunscheinkommen im Ruhestand (Netto) ca.",null,null,null,0,null,{"$f":"IF(Variablen!B6=1,\"(z.B.: 80% = ca. \"&FIXED(Hilfe!B19*0.8/12,0)&\" EUR mtl.)\",\"(z.B.: 80% = ca. \"&FIXED(Hilfe!B24*0.8/12,0)&\" EUR mtl.)\")","v":"(z.B.: 80% = ca. 2.166 EUR mtl.)"}]
["(Ermittlung auf Basis komplett steuerpflichtiges Einkommen)",null,null,null,{"$f":"\"Spitzensteuersatz: ca. \"&FIXED((steuer(Variablen!B3,Eingabe!E13*12)-steuer(Variablen!B3,Eingabe!E13*12-1))*100,2)&\"% in der Rentenphase\"","v":"Spitzensteuersatz: ca. 0,00% in der Rentenphase"}]
["Gesetzliche Rente / Versorgungswerk (Brutto)",null,null,null,2000]
["Basisrente (Brutto)",null,null,null,0]
["Riesterrente (Brutto)",null,null,null,0]
["betriebliche Altersversorgung (Brutto)",null,null,null,0]
["Mieteinkünfte (Brutto)",null,null,null,0]
["Sonstige Renten m. Ertragsanteil (Brutto)",null,null,null,0]
[]
[]
[{"$f":"\"Sonstiges verfüg. Vermögen ab dem \"&C10&\". Jahr\"","v":"Sonstiges verfüg. Vermögen ab dem 67. Jahr"},null,null,null,0,null,null,null,"Hilfsrechner (z.B. Inflation)"]
["Verrentungsart:",null,null,null,{"$f":"E24/Variablen!E13","v":0},null,null,null,"Kapital / Rente (mtl.)",null,{"$f":"E14","v":0}]
[null,null,null,null,null,null,null,null,"Zins",null,0.02]
["Gesamte Altersversorgung (Brutto) ca.",null,null,null,{"$f":"E16+E17+E18+E19+E20+E21+E25","v":2000},null,null,null,"Laufzeit",null,{"$f":"C10-C9","v":57}]
["Gesamte Altersversorgung (Netto) ca.",null,null,null,{"$f":"Hilfe!B15","v":1928.3761957376},null,null,null," => mit 67 Jahren ca.:",null,{"$f":"ROUND((K25*(1+K26)^K27)/10,0)*10","v":0}]
[]
["Zusatzbedarf GKV/PKV Beitrag im Alter",null,null,null,0,null,{"$f":"IF(E30=0,\"KV Bedarf berücksichtigen\",\"\")","v":"KV Bedarf berücksichtigen"}]
["Rentenlücke (Netto) inkl. KV ca.",null,null,null,{"$f":"MAX(0,MAX(E14-E28+E30,0))","v":0},null,{"$f":"IF(E31=0,\"Überschuss\",\"\")","v":"Überschuss"}]
[]
[{"$f":"\"Kosten eines Vertrages Laufzeit \"&Variablen!B15&\" Jahre ca.\"","v":"Kosten eines Vertrages Laufzeit 57 Jahre ca."},null,null,null,{"$f":"G33","v":1.2999999999999999E-3},null,{"$f":"Variablen!B18","v":1.2999999999999999E-3}]
[]
[]
[]
[]
[]
[]
[]
[]
[]
[]
[]
[]
["Quelle: Eigene Berechnungen auf Basis Ihrer Angaben und der gesetzlichen Daten.",null,null,null,null,null,null,{"$f":"\"1 / \"&Variablen!B1&\"\"","v":"1 / 2022"}]
["Für die Richtigkeit der Angaben kann keine Gewähr übernommen werden, denn Programm- und Berechnungsfehler sind trotz sorgfältigstem Vorgehen nicht ausgeschlossen.                                                                          "]

{"sheet":"Druck","index":1,"n_rows":0,"n_cols":0,"rows_kept":0,"cut":false,"hidden":true,"merged":[]}

{"sheet":"Variablen","index":2,"n_rows":104,"n_cols":19,"rows_kept":104,"cut":false,"hidden":true,"merged":[[26,3,26,4],[31,3,31,5],[32,4,32,5],[0,14,0,18],[16,0,16,1],[14,3,14,5],[18,3,18,4],[0,3,0,5],[12,4,12,5],[23,3,24,3],[23,4,24,4],[0,10,0,12],[0,7,0,8]]}
["Jahr",2022,null,"Rentenfaktoren",null,null,null,"Private Renten",null,null,"Basisrente",null,null,null,"Daxwerte"]
[null,null,null,"Alter","Mit Garantie","Ohne Garantie",null,{"$f":"Eingabe!C10","v":67},{"$f":"VLOOKUP(H2,H4:I104,2)","v":0.17},null,{"$f":"B1","v":2022},{"$f":"VLOOKUP(K2,K5:M28,2)","v":0.94},{"$f":"VLOOKUP(K2,K5:M28,3)","v":0.82},null,"Laufzeit","Min","Mittelwert","Max","Anzahl Perioden"]
["Nicht verheiratet",2,null,60,429,215,null,"Alter","Ertragsanteil (%)",null,{"$f":"Variablen!B1+Variablen!B15","v":2079},{"$f":"VLOOKUP(K3,K5:M28,2)","v":1},{"$f":"VLOOKUP(K3,K5:M28,3)","v":1},null,10,1.0260773259973254E-2,5.7546327638632384E-2,0.13571524217591752,626]
["verheiratet",null,null,61,415,212,null,0,0.59,null,null,"Absetzbarkeit","zu versteuern",null,11,9.0045326546746886E-3,5.7348313224677185E-2,0.13089584718938421,614]
[null,null,null,62,401,210,null,1,0.59,null,2022,0.94,0.82,null,12,1.0661566447326017E-2,5.7439106935899882E-2,0.12464875304130613,602]
["Bruttoeinkommen p.a.",1,null,63,388,208,null,2,0.57999999999999996,null,{"$f":"K5+1","v":2023},{"$f":"IF(K6>2025,1,L5+2%)","v":0.96},{"$f":"IF(K6>2020,IF(K6>2040,100%,M5+1%),M5+2%)","v":0.83},null,13,1.1417348913176945E-2,5.7610690758724777E-2,0.1230823515214331,590]
["Nettoeinkommen p.a.",null,null,64,374,205,null,3,0.57999999999999996,null,2024,0.98,0.84,null,14,1.0122697426292451E-2,5.7855661102952025E-2,0.12098401277418216,578]
[null,null,null,65,361,203,null,4,0.56999999999999995,null,2025,1,0.85,null,15,9.0283536608991525E-3,5.8450681657287631E-2,0.11641458853265951,566]
["Mit Garantie (klassisch)",1,null,66,348,201,null,5,0.56999999999999995,null,2026,1,0.86,null,16,1.0302497511491223E-2,5.9304482811784395E-2,0.11232857916721893,554]
["75% Garantie / 25% ohne",{"$f":"IF(B9=1,A9,IF(B9=2,A10,IF(B9=3,A11,IF(B9=4,A12,A13))))","v":"Mit Garantie (klassisch)"},null,67,335,198,null,6,0.56000000000000005,null,2027,1,0.87,null,17,1.181881560338096E-2,6.0162318682374857E-2,0.11258098667728098,542]
["50% Garantie / 50% ohne",null,null,"Faktor",{"$f":"VLOOKUP(Eingabe!C10,Variablen!D3:F11,2)","v":335},{"$f":"VLOOKUP(Eingabe!C10,Variablen!D3:F11,3)","v":198},null,7,0.56000000000000005,null,2028,1,0.88,null,18,1.1033498860095725E-2,6.1030989239705936E-2,0.11255495315676046,530]
["25% Garantie / 75% ohne",null,null,"Auswahl",{"$f":"IF(B9=1,100%,IF(B9=2,75%,IF(B9=3,50%,IF(B9=4,25%,IF(B9=5,0%,100%)))))","v":1},{"$f":"1-E12","v":0},null,8,0.56000000000000005,null,2029,1,0.89,null,19,1.1282003636983069E-2,6.1908582687005914E-2,0.11467162427412292,518]
["Ohne Garantie (fondsgeb.)",null,null,"Mischfaktor:",{"$f":"E11*E12+F11*F12","v":335},null,null,9,0.55000000000000004,null,2030,1,0.9,null,20,1.1716713955294394E-2,6.2731605274596008E-2,0.11549003480719308,506]
[null,null,null,null,null,null,null,10,0.55000000000000004,null,2031,1,0.91,null,21,1.1964196472696425E-2,6.3621138764988136E-2,0.11572650549583886,494]
["Aufschubzeit",{"$f":"MAX(Eingabe!C10-Eingabe!C9,0)","v":57},null,"Beitragsgarantie gewünscht?",null,null,null,11,0.54,null,2032,1,0.92,null,22,1.1092807331060882E-2,6.4675575243752392E-2,0.11489311338332596,482]
[null,null,null,"Nein",null,1,null,12,0.54,null,2033,1,0.93,null,23,1.0644747975614897E-2,6.5870349499043065E-2,0.11293478601211858,470]
["Kosten eines Vertrages",null,null,"Ja","Kosten:",0.3,null,13,0.53,null,2034,1,0.94000000000000006,null,24,1.4042962889079818E-2,6.7144346791710455E-2,0.1108562459108334,458]
[{"$f":"B15","v":57},{"$f":"IF(A18<10,B19,VLOOKUP(A18,A19:B59,2))","v":1.2999999999999999E-3},null,null,null,null,null,14,0.53,null,2035,1,0.95000000000000007,null,25,1.8632204017882167E-2,6.8379581497945263E-2,0.10890217461790995,446]
[10,2.9000000000000001E-2,null,"Riester Zulagen",null,null,null,15,0.52,null,2036,1,0.96000000000000008,null,26,2.6691187303115649E-2,6.9501543101361793E-2,0.10679558563059101,434]
[{"$f":"A19+1","v":11},2.7E-2,null,"Kinder vor 2008",185,null,null,16,0.52,null,2037,1,0.97000000000000008,null,27,3.9263158053349484E-2,7.0320001405672405E-2,0.10509812077396401,422]
[{"$f":"A20+1","v":12},2.35E-2,null,"Kinder nach 2008",300,null,null,17,0.51,null,2038,1,0.98000000000000009,null,28,4.7098126387715725E-2,7.0869759788648387E-2,0.10365544172157032,410]
[13,2.0500000000000001E-2,null,"Grundzulage",175,"geändert in 2018",null,18,0.51,null,2039,1,0.9900000000000001,null,29,4.83484802683527E-2,7.1302389997794507E-2,0.10195611012365842,398]
[14,1.9E-2,null,null,null,null,null,19,0.5,null,2040,1,1,null,30,5.1566589583357636E-2,7.166459794169143E-2,9.958851867898813E-2,386]
[15,1.7000000000000001E-2,null,"Max. Rendite bei Beitragsgarantie",0.02,null,null,20,0.5,null,2041,1,1,null,31,5.4414268052191295E-2,7.191128550796988E-2,9.7562800715693176E-2,374]
[16,1.4999999999999999E-2,null,null,null,null,null,21,0.49,null,2042,1,1,null,32,5.3152715032958264E-2,7.2156981275258714E-2,9.5589400769788502E-2,362]
[17,1.4E-2,null,null,null,null,null,22,0.49,null,2043,1,1,null,33,5.2330881361393196E-2,7.2465360057682726E-2,9.3262528463848401E-2,350]
[18,1.2999999999999999E-2,null,"BBG Knappschaft",null,"Beitragssatz",null,23,0.48,null,2044,1,1,null,34,5.3494955272384695E-2,7.2790940866619622E-2,9.109330902655062E-2,338]
[19,1.15E-2,null,"Basisrente",96000,0.247,null,24,0.48,null,2045,1,1,null,35,5.4827428689146904E-2,7.3066702949998688E-2,8.9484330681309732E-2,326]
[20,1.15E-2,null,25639,{"$f":"D29*B3","v":51278},null,null,25,0.47,null,null,null,null,null,36,5.4273989767256503E-2,7.3381331423619536E-2,8.8313922863288707E-2,314]
[21,1.0500000000000001E-2,null,null,null,null,null,26,0.47,null,null,null,null,null,37,5.5948277416103795E-2,7.3712138423503423E-2,8.670591443713746E-2,302]
[22,0.01,null,null,null,null,null,27,0.46,null,null,null,null,null,38,6.0496764289310653E-2,7.3935716510545951E-2,8.5000989947853281E-2,290]
[23,9.4999999999999998E-3,null,"Notwendiges Kapital Ruhestandsplanung",null,null,null,28,0.45,null,null,null,null,null,39,6.6765989913457419E-2,7.3905247534053115E-2,8.3439763043030593E-2,278]
[24,8.9999999999999993E-3,null,"Lücke","Kapital mit Faktor aus Eingabe",null,null,29,0.45,null,null,null,null,null,40,6.7480328504256767E-2,7.359318656533799E-2,8.2210257858372354E-2,266]
[25,8.0000000000000002E-3,null,{"$f":"Ruhestandsplanung!E8-'Ruhestandsplanung Berechnung'!AI5","v":-1928.3761957376},{"$f":"D34*E13*(1+IF('Ruhestandsplanung Berechnung'!AU5=0,0,'Ruhestandsplanung Berechnung'!AY5))","v":-646006.025572096},"nur Lücke",null,30,0.44,null,null,null,null,null,41,6.6801881070514602E-2,7.2990028312728994E-2,8.0618318819494078E-2,254]
[26,7.4999999999999997E-3,null,null,{"$f":"'Ruhestandsplanung Berechnung'!AS35","v":-170703.28098140593},"zusätzlich dyn. Lücke",null,31,0.44,null,null,null,null,null,42,6.5861228158215865E-2,7.2112611808989688E-2,7.8953096910396967E-2,242]
[27,7.0000000000000001E-3,null,"Steueranteil",null,null,null,32,0.43,null,null,null,null,null,43,6.4923189416606367E-2,7.1134350828169282E-2,7.6911671183653316E-2,230]
[28,6.4999999999999997E-3,null,null,null,null,null,33,0.42,null,null,null,null,null,44,6.4256432397956836E-2,7.0256714601657624E-2,7.5237888863715546E-2,218]
[29,6.4999999999999997E-3,null,null,null,null,null,34,0.42,null,null,null,null,null,45,6.3384215141250311E-2,6.9548722168907215E-2,7.5175661565411361E-2,206]
[30,6.0000000000000001E-3,null,null,null,null,null,35,0.41,null,null,null,null,null,46,6.2296701080489417E-2,6.9056352235824237E-2,7.4619919331163465E-2,194]
[31,6.0000000000000001E-3,null,null,null,null,null,36,0.4,null,null,null,null,null,47,6.1610382955836922E-2,6.8814395228106756E-2,7.3953539154081899E-2,182]
[32,5.4999999999999997E-3,null,null,null,null,null,37,0.4,null,null,null,null,null,48,6.319017543271202E-2,6.8593797223486005E-2,7.3322659432184897E-2,170]
[{"$f":"A41+1","v":33},5.0000000000000001E-3,null,null,null,null,null,38,0.39,null,null,null,null,null,49,6.3690500381869269E-2,6.8183357513505294E-2,7.2540754111505484E-2,158]
[34,5.0000000000000001E-3,null,null,null,null,null,39,0.38,null,null,null,null,null,50,6.3015229520767491E-2,6.7752675873666013E-2,7.180926821675862E-2,146]
[35,4.4999999999999997E-3,null,null,null,null,null,40,0.38,null,null,null,null,null,51,6.2555641439965989E-2,6.7357062791891825E-2,7.1227569657017209E-2,134]
[36,4.4000000000000003E-3,null,null,null,null,null,41,0.37,null,null,null,null,null,52,6.1723809534443147E-2,6.6994774677754762E-2,7.0582012373322789E-2,122]
[37,4.4000000000000003E-3,null,null,null,null,null,42,0.36,null,null,null,null,null,53,6.0919875424809089E-2,6.6808312331773881E-2,7.0018949825619139E-2,110]
[{"$f":"A46+1","v":38},4.3E-3,null,null,null,null,null,43,0.35,null,null,null,null,null,54,6.0562548669864394E-2,6.6890820348464858E-2,6.9357202437447224E-2,98]
[39,4.3E-3,null,null,null,null,null,44,0.35,null,null,null,null,null,55,6.2422463798288495E-2,6.6970882093384795E-2,6.8778680325110905E-2,86]
[{"$f":"A48+1","v":40},4.1999999999999997E-3,null,null,null,null,null,45,0.34,null,null,null,null,null,56,6.380301590545398E-2,6.6874377095166082E-2,6.8381200149622248E-2,74]
[41,4.0000000000000001E-3,null,null,null,null,null,46,0.33,null,null,null,null,null,57,6.4159464189452675E-2,6.6699765937169364E-2,6.7767909890470518E-2,62]
[42,3.5999999999999999E-3,null,null,null,null,null,47,0.33,null,null,null,null,null,58,6.5307640557062355E-2,6.644608485169963E-2,6.7100082178680159E-2,50]
[43,3.2000000000000002E-3,null,null,null,null,null,48,0.32,null,null,null,null,null,59,6.5710070773027013E-2,6.5948654912210941E-2,6.65881778542112E-2,38]
[44,2.8E-3,null,null,null,null,null,49,0.31,null,null,null,null,null,60,6.4960280963716324E-2,6.5310603100397699E-2,6.6028008999371085E-2,26]
[45,2.5999999999999999E-3,null,null,null,null,null,50,0.3,null,null,null,null,null,{"$f":"Variablen!B15","v":57},{"$f":"VLOOKUP(O54,O3:S53,2,FALSE)","v":6.4159464189452675E-2},{"$f":"VLOOKUP(O54,O3:S53,3,FALSE)","v":6.6699765937169364E-2},{"$f":"VLOOKUP(O54,O3:S53,4,FALSE)","v":6.7767909890470518E-2},{"$f":"VLOOKUP(O54,O3:S53,5,FALSE)","v":62}]
[46,2.3999999999999998E-3,null,null,null,null,null,51,0.28999999999999998]
[47,2.0999999999999999E-3,null,null,null,null,null,52,0.28999999999999998]
[48,1.9E-3,null,null,null,null,null,53,0.28000000000000003]
[49,1.6000000000000001E-3,null,null,null,null,null,54,0.27]
[{"$f":"A58+1","v":50},1.2999999999999999E-3,null,null,null,null,null,55,0.26]
[null,null,null,null,null,null,null,56,0.26]
[null,null,null,null,null,null,null,57,0.25]
[null,null,null,null,null,null,null,58,0.24]
[null,null,null,null,null,null,null,59,0.23]
[null,null,null,null,null,null,null,60,0.22]
[null,null,null,null,null,null,null,61,0.22]
[null,null,null,null,null,null,null,62,0.21]
[null,null,null,null,null,null,null,63,0.2]
[null,null,null,null,null,null,null,64,0.19]
[null,null,null,null,null,null,null,65,0.18]
[null,null,null,null,null,null,null,66,0.18]
[null,null,null,null,null,null,null,67,0.17]
[null,null,null,null,null,null,null,68,0.16]
[null,null,null,null,null,null,null,69,0.15]
[null,null,null,null,null,null,null,70,0.15]
[null,null,null,null,null,null,null,71,0.14000000000000001]
[null,null,null,null,null,null,null,72,0.13]
[null,null,null,null,null,null,null,73,0.13]
[null,null,null,null,null,null,null,74,0.12]
[null,null,null,null,null,null,null,75,0.11]
[null,null,null,null,null,null,null,76,0.1]
[null,null,null,null,null,null,null,77,0.1]
[null,null,null,null,null,null,null,78,0.09]
[null,null,null,null,null,null,null,79,0.09]
[null,null,null,null,null,null,null,80,0.08]
[null,null,null,null,null,null,null,81,7.0000000000000007E-2]
[null,null,null,null,null,null,null,82,7.0000000000000007E-2]
[null,null,null,null,null,null,null,83,0.06]
[null,null,null,null,null,null,null,84,0.06]
[null,null,null,null,null,null,null,85,0.05]
[null,null,null,null,null,null,null,86,0.05]
[null,null,null,null,null,null,null,87,0.05]
[null,null,null,null,null,null,null,88,0.04]
[null,null,null,null,null,null,null,89,0.04]
[null,null,null,null,null,null,null,90,0.04]
[null,null,null,null,null,null,null,91,0.04]
[null,null,null,null,null,null,null,92,0.03]
[null,null,null,null,null,null,null,93,0.03]
[null,null,null,null,null,null,null,94,0.02]
[null,null,null,null,null,null,null,95,0.02]
[null,null,null,null,null,null,null,96,0.02]
[null,null,null,null,null,null,null,97,0.01]
[null,null,null,null,null,null,null,98,0.01]
[null,null,null,null,null,null,null,99,0.01]
[null,null,null,null,null,null,null,100,0.01]

{"sheet":"Hilfe","index":3,"n_rows":34,"n_cols":5,"rows_kept":34,"cut":false,"hidden":true,"merged":[[0,0,0,1],[20,0,20,1],[25,0,25,1],[30,0,30,1],[0,3,0,4],[19,3,19,4]]}
["Berechnung Einkommensteuer",null,null,"Grafik Einkommen"]
["Renteneintritt im Jahr",{"$f":"Variablen!B1+Variablen!B15","v":2079},null,{"$f":"Eingabe!A13","v":"Wunscheinkommen im Ruhestand (Brutto) ca."},{"$f":"Eingabe!E13","v":0}]
["Spitzensteuersatz im Alter",{"$f":"steuer(Variablen!B3,Eingabe!G10)-steuer(Variablen!B3,Eingabe!G10-1)","v":0.25330370056190077},null,"GRV / Versorgungswerk",{"$f":"Eingabe!E16","v":2000}]
[null,null,null,{"$f":"Eingabe!A17","v":"Basisrente (Brutto)"},{"$f":"Eingabe!E17","v":0}]
["Einkommensart","Steuerpflichtig",null,{"$f":"Eingabe!A18","v":"Riesterrente (Brutto)"},{"$f":"Eingabe!E18","v":0}]
[{"$f":"Eingabe!A16","v":"Gesetzliche Rente / Versorgungswerk (Brutto)"},{"$f":"Eingabe!E16*Variablen!$M$3","v":2000},null,"bAV",{"$f":"Eingabe!E19","v":0}]
[{"$f":"Eingabe!A17","v":"Basisrente (Brutto)"},{"$f":"Eingabe!E17*Variablen!$M$3","v":0},null,{"$f":"Eingabe!A20","v":"Mieteinkünfte (Brutto)"},{"$f":"Eingabe!E20","v":0}]
[{"$f":"Eingabe!A18","v":"Riesterrente (Brutto)"},{"$f":"Eingabe!E18","v":0},null,{"$f":"Eingabe!A21","v":"Sonstige Renten m. Ertragsanteil (Brutto)"},{"$f":"Eingabe!E21","v":0}]
[{"$f":"Eingabe!A19","v":"betriebliche Altersversorgung (Brutto)"},{"$f":"Eingabe!E19","v":0},null,"Rente aus Kapital",{"$f":"Eingabe!E25","v":0}]
[{"$f":"Eingabe!A20","v":"Mieteinkünfte (Brutto)"},{"$f":"Eingabe!E20","v":0},null,"Rentenlücke",{"$f":"Eingabe!E30","v":0}]
[{"$f":"Eingabe!A21","v":"Sonstige Renten m. Ertragsanteil (Brutto)"},{"$f":"Eingabe!E21*Variablen!I2","v":0}]
["Sonstiges Vermögen (mit Ertragsanteil)",{"$f":"Eingabe!E25*Variablen!I2","v":0}]
["Gesamt Steuerpflichtig p.a.",{"$f":"SUM(B6:B12)*12","v":24000},"Für die Steuerberechnung"]
["Steuer",{"$f":"steuer(Variablen!B3,Hilfe!B13)","v":859.48565114879989}]
["Nettoeinkommen mtl.",{"$f":"((Eingabe!E16+Eingabe!E17+Eingabe!E18+Eingabe!E19+Eingabe!E20+Eingabe!E21+Eingabe!E25)*12-B14)/12","v":1928.3761957376},"(Wichtig: Brutto von Steuer abziehen!)"]
["Rentenlücke (netto)",{"$f":"MAX(B29-B15,0)","v":0}]
["Einkommen",{"$f":"Eingabe!G10","v":36000},null,"Bruttoeinkommen",{"$f":"IF(Variablen!B6=1,Eingabe!G10,Hilfe!B22)","v":36000}]
["Brutto",{"$f":"IF(Variablen!B6=1,B17,0)","v":36000}]
["Netto",{"$f":"IF(Variablen!B6=1,Hilfe!B17-steuer(Variablen!B3,Hilfe!B17),0)","v":32497.430062034327}]
[null,null,null,"Druck"]
["Zielwertsuche aus Netto mach Brutto",null,null,"Wieviel Sicherheit",true]
["Bruttogehalt",40721.676153490458,null,"Schichtennavigator",true]
["Steuer",{"$f":"steuer(Variablen!B3,Hilfe!B22)","v":4721.6761534904572},null,"Inflation",false]
["Nettogehalt",{"$f":"B22-B23","v":36000},null,"Ruhestandsplanung",false]
[null,null,null,"Risikostufe",true]
["Vorgabe Bruttorente"]
["Wunschrente Brutto",{"$f":"Eingabe!E13","v":0},null,"Bruttoeinkommen",{"$f":"IF(Variablen!B6=1,Hilfe!B18,Hilfe!B22)","v":36000}]
["Steuer Brutto",{"$f":"steuer(Variablen!B3,Hilfe!B27*12)/12","v":0},null,"Nettoeinkommen",{"$f":"IF(Variablen!B6=1,B19,B24)","v":32497.430062034327}]
["Wunschrente Netto",{"$f":"B27-B28","v":0}]
[]
["Vorgabe  Nettorente"]
["Wunschrente Brutto",3000.0362946020509]
["Steuer Brutto",{"$f":"steuer(Variablen!B3,Hilfe!B32*12)/12","v":291.89011199579767}]
["Wunschrente Netto",{"$f":"B32-B33","v":2708.1461826062532}]

{"sheet":"Sicherheit","index":4,"n_rows":29,"n_cols":8,"rows_kept":29,"cut":false,"hidden":false,"merged":[[8,0,8,3],[4,0,4,7],[22,0,22,7],[5,0,5,7],[7,0,7,3],[7,4,7,5],[8,4,8,5],[9,4,9,5],[9,0,9,3],[13,0,13,3],[14,0,14,3],[19,0,19,3],[14,4,14,5],[10,0,10,3],[11,0,11,3],[11,4,11,5],[28,0,28,7],[21,0,21,7],[16,0,16,7],[24,0,24,7],[25,0,25,7],[23,0,23,7],[20,0,20,7],[10,6,11,7],[19,4,19,5],[12,6,13,7],[14,6,14,7],[19,6,19,7]]}
[]
[]
[]
[]
[{"$f":"IF(YEAR(TODAY())=Variablen!B1,\"Wieviel Sicherheit kann ich mir leisten?\",\"Das Tool ist abgelaufen!\")","v":"Wieviel Sicherheit kann ich mir leisten?"}]
["Eingabe"]
[]
["Wunscheinkommen (Netto)",null,null,null,{"$f":"Eingabe!E14","v":0}]
["Rentenlücke (Netto)",null,null,null,{"$f":"MAX(Eingabe!E31,0)","v":0}]
["Spardauer",null,null,null,{"$f":"Variablen!B15","v":57}]
[null,null,null,null,null,null,{"$f":"\"Der Kapitalbedarf wird entsprechend Ihrer Rentenvorgabe berechnet! [\"&Variablen!B10&\"]\"","v":"Der Kapitalbedarf wird entsprechend Ihrer Rentenvorgabe berechnet! [Mit Garantie (klassisch)]"}]
["Kapitalbedarf ca.",null,null,null,{"$f":"ROUND(E9*Variablen!E13/100,0)*100","v":0}]
[null,null,null,null,null,null,"Notwendiger \nBeitrag / Zins"]
[]
["Zinsvorgabe (Berechnet wird der notwendige Beitrag)",null,null,null,0.02,null,{"$f":"-PMT((E15-Eingabe!E33)/12,Variablen!B15*12,0,E12)","v":0}]
[]
[{"$f":"\"Da Sie eine Rendite von \"&FIXED(E15*100,2)&\"% in der Ansparphase ansetzen, bedingt dies einen Beitrag von ca. \"&FIXED(G15,0)&\" EUR mtl..\nFalls Sie dieses Kapital nicht haben, bleiben Ihnen zwei Möglichkeiten:\n1) Das vorhandene Kapital wird volatiler verrentet, so dass die erwartete Rente steigt und die Lücke sinkt.\n2)\"&\" Sie können den Beitrag vorgeben, der als Sparbeitrag in Frage kommt. Es wird dann die notwendige Rendite errechnet. Achtung: Eine Rendite über 9% p.a. ist bei einer Laufzeit von \"&E10&\" Jahren unrealistisch.\"","v":"Da Sie eine Rendite von 2,00% in der Ansparphase ansetzen, bedingt dies einen Beitrag von ca. 0 EUR mtl..\nFalls Sie dieses Kapital nicht haben, bleiben Ihnen zwei Möglichkeiten:\n1) Das vorhandene Kapital wird volatiler verrentet, so dass die erwartete Rente steigt und die Lücke sinkt.\n2) Sie können den Beitrag vorgeben, der als Sparbeitrag in Frage kommt. Es wird dann die notwendige Rendite errechnet. Achtung: Eine Rendite über 9% p.a. ist bei einer Laufzeit von 57 Jahren unrealistisch."}]
[]
[]
["Beitragsvorgabe (Berechnet wird der notwendige Zins)",null,null,null,100,null,{"$f":"MAX(0,RATE(E10*12,-E20,E12,0,1)*(-12))+Eingabe!E33","v":{"$error":"#NUM!"}}]
[]
[{"$f":"\"Bei einem vorgegebenen Beitrag von \"&E20&\" EUR mtl. benötigen Sie eine Rendite / Zins in Höhe von \"&FIXED(G20*100,2)&\"%. \"&IF(G20>Variablen!E24,\"Diese Rendite ist mit einer Anlage mit Garantie / viel Sicherheit nicht realistisch.\",\"\")&\"\"","v":{"$error":"#NUM!"}}]
["Das gegenwärtige Niedrigzinsumfeld lässt die meisten Finanzberater zur Basisberatung zurückkehren. Folgende Fragen sind dabei elementar:\n• Wann möchte der Sparer über sein Geld verfügen? (=> Rentenbeginn? => Dies bestimmt die Laufzeit!)\n• Wie hoch ist der Geldbedarf zum Rentenbeginn? (=> Rentenlücke? => Dies bestimmt das Ziel!)\n• Welchen Betrag kann der Sparer heute aufwenden? (=> Beitrag?)\nMit diesen drei Vorgaben (Laufzeit / Rentenbeginn, Ziel / Rentenlücke, Beitrag), kann mit Hilfe reiner Mathematik (Zinseszinsformel einer Anlage) der notwendige Zins berechnet werden. Falls dann doch der Beitrag vorgegeben werden soll, wird der dann notwendige Zins / Rendite ermittelt.\n\n"]
[{"$f":"\"Die Rendite ist dabei ein Maß für das Anlagerisiko: In einem Niedrigzinsumfeld können sichere oder garantierte Anlagen meist weniger als \"&Variablen!E24*100&\"% p.a. erwirtschaften. Wird jedoch mehr als \"&Variablen!E24*100&\"% Rendite p.a. für die realistische Sparzielerreichung benötigt, muss ein höheres Anlagerisiko damit einhergehen.\n\nLetztlich muss sich der Sparer entscheiden: Mehr Risiko eingehen, Rentenerwartung senken oder mehr Beitrag leisten!\"","v":"Die Rendite ist dabei ein Maß für das Anlagerisiko: In einem Niedrigzinsumfeld können sichere oder garantierte Anlagen meist weniger als 2% p.a. erwirtschaften. Wird jedoch mehr als 2% Rendite p.a. für die realistische Sparzielerreichung benötigt, muss ein höheres Anlagerisiko damit einhergehen.\n\nLetztlich muss sich der Sparer entscheiden: Mehr Risiko eingehen, Rentenerwartung senken oder mehr Beitrag leisten!"}]
[{"$f":"\"ACHTUNG: In dieser Berechnung ist ein Kostensatz in Höhe von \"&FIXED(Eingabe!E33*100,2)&\"% eingeflossen. Die Inflation wurde nicht berücksichtigt. Dies kann aber umgesetzt werden, indem das Wunscheinkommen mittels ''Hilfsrechner'' an die Inflation angepasst wird.\"","v":"ACHTUNG: In dieser Berechnung ist ein Kostensatz in Höhe von 0,13% eingeflossen. Die Inflation wurde nicht berücksichtigt. Dies kann aber umgesetzt werden, indem das Wunscheinkommen mittels ''Hilfsrechner'' an die Inflation angepasst wird."}]
["\nDie Rendite ist dabei ein Maß für das Anlagerisiko: In einem Niedrigzinsumfeld können sichere oder garantierte Anlagen meist weniger als 3% p.a. erwirtschaften. Wird jedoch mehr als 3% Rendite p.a. für die realistische Sparzielerreichung benötigt, muss ein höheres Anlagerisiko damit einhergehen.\n\nLetztlich muss sich der Sparer entscheiden: Mehr Risiko eingehen oder mehr Beitrag leisten!\n\n"]
[]
["Quelle: Eigene Berechnungen auf Basis Ihrer Angaben und der gesetzlichen Daten.",null,null,null,null,null,null,{"$f":"\"1/\"&Variablen!B1&\"\"","v":"1/2022"}]
["Für die Richtigkeit der Angaben kann keine Gewähr übernommen werden, denn Programm- und Berechnungsfehler sind trotz sorgfältigstem Vorgehen nicht ausgeschlossen.                                                                          "]

{"sheet":"Schichtennavigator","index":5,"n_rows":21,"n_cols":8,"rows_kept":21,"cut":false,"hidden":true,"merged":[[21,0,21,3],[22,0,22,3],[13,0,13,3],[13,4,13,5],[13,6,13,7],[18,4,18,5],[19,4,19,5],[20,4,20,5],[18,0,18,3],[19,0,19,3],[20,0,20,3],[14,2,14,3],[14,4,14,5],[15,2,15,3],[15,4,15,5],[17,2,17,3],[17,4,17,5],[10,2,10,3],[10,4,10,5],[11,2,11,3],[11,4,11,5],[12,4,12,5],[12,0,12,3],[16,2,16,3],[16,4,16,5],[4,0,4,7],[5,0,5,7],[9,2,9,3],[8,3,8,4],[7,0,7,7],[9,4,9,5]]}
[]
[]
[]
[]
[{"$f":"IF(YEAR(TODAY())=Variablen!B1,\"Schichtennavigator\",\"Das Tool ist abgelaufen!\")","v":"Schichtennavigator"}]
[{"$f":"IF(YEAR(TODAY())=Variablen!B1,\" (Rentenvergleich nach Steuer) \",\"Das Tool ist abgelaufen!\")","v":" (Rentenvergleich nach Steuer) "}]
[]
["Eingabe"]
[]
[null,null,{"$f":"Eingabe!A9","v":"Alter"},null,{"$f":"Eingabe!C9","v":10}]
[null,null,{"$f":"Eingabe!A10","v":"Beginn Ruhestand"},null,{"$f":"Eingabe!C10","v":67}]
[null,null,"Bruttoeinkommen",null,{"$f":"ROUND(IF(Variablen!B6=1,Eingabe!G10,Hilfe!B22)/10,0)*10","v":36000}]
[{"$f":"Eingabe!A14","v":"Wunscheinkommen im Ruhestand (Netto) ca."},null,null,null,{"$f":"Eingabe!E14","v":0},null,{"$f":"Eingabe!E14+Eingabe!E30","v":0},"(inkl. KV)"]
[{"$f":"Eingabe!A31","v":"Rentenlücke (Netto) inkl. KV ca."},null,null,null,{"$f":"Eingabe!E31","v":0},null,"(abzusichern durch neuen Sparvertrag)"]
[null,null,"Kinder vor 2008",null,0]
[null,null,"Kinder ab 2008",null,0]
[null,null,"Zins vor Kosten",null,{"$f":"Sicherheit!G20","v":{"$error":"#NUM!"}}]
[]
["Beitragsgarantie in der Ansparphase gewünscht?"]
[]
["Verrentungsart"]

{"sheet":"Inflation","index":6,"n_rows":76,"n_cols":7,"rows_kept":76,"cut":false,"hidden":true,"merged":[[10,1,10,2],[10,3,10,4],[20,0,20,6],[23,0,23,2],[24,0,24,2],[16,4,16,5],[11,3,11,4],[11,0,11,2],[10,5,11,6],[30,0,30,6],[31,0,31,6],[19,0,19,6],[33,0,33,6],[12,0,12,6],[26,0,26,2],[27,0,27,2],[28,0,28,2],[29,0,29,2],[13,0,13,6],[14,0,14,6],[15,0,15,6],[25,0,25,2],[36,0,36,2],[37,0,37,2],[38,0,38,2],[39,0,39,2],[34,0,34,6],[42,0,42,2],[40,0,40,2],[41,0,41,2],[46,0,46,6],[45,0,45,6],[49,0,49,2],[50,0,50,2],[51,0,51,2],[52,0,52,2],[53,0,53,2],[54,0,54,2],[55,0,55,2],[74,0,74,4],[75,0,75,5],[57,0,57,5]]}
[]
[]
[]
[]
[]
[]
[]
[]
[]
[]
[null,"angenommene Inflation",null,0.02,null,{"$f":"IF(OR(Eingabe!E13=0,Eingabe!E14=0),\"Bitte Wunscheinkommen unter Eingabe eingeben!\",IF(ROUND('Inflation Berechnung'!G12/10,0)*10=ROUND('Inflation Berechnung'!G13/10,0)*10,\"\",\"''Berechnen'' drücken!\"))","v":"Bitte Wunscheinkommen unter Eingabe eingeben!"}]
["gewünschte Dynamik (teildynamischer Beitrag)",null,null,{"$f":"D11","v":0.02}]
["Inflation (von lat. inflatio „Schwellung“, „Anschwellen“) bezeichnet in der Volkswirtschaftslehre eine allgemeine und anhaltende Erhöhung des Preisniveaus von Gütern und Dienstleistungen (Teuerung), gleichbedeutend mit einer Minderung der Kaufkraft des Geldes. (Zitat Wikipedia)"]
["Die Inflation bezieht sich auf einen sogenannten Warenkorb, in welchen Güter und Dienstleistungen des allgemeinen Lebens bewertet und eingepreist sind."]
["Auf der Internetseite \"www.destatis.de\" steht ein individueller Inflationsrechner zur Verfügung. Dort kann über die Eingabe der persönlichen Konsumgewohnheiten die individuelle Inflation berechnet werden."]
["Generell sollte bei der Schlißung Ihrer Rentenlücke oder bei dem notwendigen Kapital für Ihre Rente die Inflation berücksichtigt werden. Dies kann über folgende Gestaltung der Beitragszahlung erfolgen: ",null,null,null,null,null,1.2676392665824478E+22]
[null,null,null,null,{"$f":"Schichtennavigator!E17","v":{"$error":"#NUM!"}}]
[null,null,null,null,{"$f":"E14","v":0}]
[]
["1) Konstanter Beitrag"]
[{"$f":"\"Mit der vorgegebenen Inflation wird der Kapitalbedarf für die Zukunft berechnet. Wenn dieser Kapitalbedarf bekannt ist, kann mittels Zinseszinsformel mit den Größen ''Laufzeit'' (\"&'Inflation Berechnung'!B2&\" Jahre) und ''Zins'' (siehe Schichtennavigator) der notwendige Beitrag errechnet werden.\"","v":"Mit der vorgegebenen Inflation wird der Kapitalbedarf für die Zukunft berechnet. Wenn dieser Kapitalbedarf bekannt ist, kann mittels Zinseszinsformel mit den Größen ''Laufzeit'' (57 Jahre) und ''Zins'' (siehe Schichtennavigator) der notwendige Beitrag errechnet werden."}]
[]
[null,null,null,{"$f":"'Inflation Berechnung'!B11","v":"Basisrente"},{"$f":"'Inflation Berechnung'!C11","v":"Riesterrente"},{"$f":"'Inflation Berechnung'!D11","v":"Privatrente"}]
[{"$f":"'Inflation Berechnung'!A12","v":"Kapitalbedarf ohne Inflation"},null,null,{"$f":"'Inflation Berechnung'!B12","v":335000},{"$f":"'Inflation Berechnung'!C12","v":335000},{"$f":"'Inflation Berechnung'!D12","v":270000}]
[{"$f":"'Inflation Berechnung'!A13","v":"Zins"},null,null,{"$f":"'Inflation Berechnung'!B13","v":{"$error":"#NUM!"}},{"$f":"'Inflation Berechnung'!C13","v":{"$error":"#NUM!"}},{"$f":"'Inflation Berechnung'!D13","v":{"$error":"#NUM!"}}]
[{"$f":"'Inflation Berechnung'!A14","v":"Beitrag (Brutto) ohne Inflation mtl."},null,null,{"$f":"'Inflation Berechnung'!B14","v":{"$error":"#NUM!"}},{"$f":"'Inflation Berechnung'!C14","v":{"$error":"#NUM!"}},{"$f":"'Inflation Berechnung'!D14","v":{"$error":"#NUM!"}}]
[]
[{"$f":"'Inflation Berechnung'!A16","v":"Kapitalbedarf mit Inflation"},null,null,{"$f":"'Inflation Berechnung'!B16","v":1035749.1783914296},{"$f":"'Inflation Berechnung'!C16","v":1035749.1783914296},{"$f":"'Inflation Berechnung'!D16","v":834782.91989757016}]
[{"$f":"'Inflation Berechnung'!A17","v":"Beitrag (Brutto) mit Inflation mtl."},null,null,{"$f":"'Inflation Berechnung'!B17","v":{"$error":"#NUM!"}},{"$f":"'Inflation Berechnung'!C17","v":{"$error":"#NUM!"}},{"$f":"'Inflation Berechnung'!D17","v":{"$error":"#NUM!"}}]
[]
[{"$f":"\"Dies bedeutet, dass inflationsbereinigt (angenommene Inflation: \"&FIXED(D11*100,2)&\"% p.a.) in \"&Variablen!B15&\" Jahren ein Betrag von \"&FIXED(D28,0)&\" EUR oder \"&FIXED(E28,0)&\" EUR oder \"&FIXED(F28,0)&\" EUR benötigt wird, um die Lücke in Höhe von \"&FIXED(Eingabe!E30,0)&\" EUR zu schließen. Je nachdem welchen Weg Sie nutzen wird ein konstanter Beitrag von \"&FIXED(D29,0)&\" EUR mtl. oder \"&FIXED(E29,0)&\" EUR mtl. oder \"&FIXED(F29,0)&\" EUR mtl. fällig.\"","v":{"$error":"#NUM!"}}]
[{"$f":"\"Falls Ihnen der Beitrag zu hoch ist, könnten Sie einen teildynamischen Beitrag wählen. Dies bedeutet Sie dynamisieren den Beitrag in Höhe der Inflation (\"&D11*100&\"%) und Beitrag steigt jedes Jahr leicht an.\"","v":"Falls Ihnen der Beitrag zu hoch ist, könnten Sie einen teildynamischen Beitrag wählen. Dies bedeutet Sie dynamisieren den Beitrag in Höhe der Inflation (2%) und Beitrag steigt jedes Jahr leicht an."}]
[]
["2) Teildynamischer Beitrag"]
[{"$f":"\"Die EZB hat als Ziel eine Inflation in Höhe von knapp 2% p.a.. Bei dieser Herangehensweise könnte deswegen geplant werden, den Beitrag jedes Jahr um ca. \"&D12*100&\"% p.a. (oder jedes zweite Jahr um ca. \"&D12*200&\"% p.a.) zu erhöhen. \"&\"Falls die 2% p.a. Inflation wirklich eintritt, würde die Dynamik aber für die Schließung der Lücke nicht reichen. Im Erstbeitrag ist deswegen bereits ein ''Sicherheitspuffer'' berücksichtigt, damit künftige Beitragserhöhungen moderater ausfallen können.\"","v":"Die EZB hat als Ziel eine Inflation in Höhe von knapp 2% p.a.. Bei dieser Herangehensweise könnte deswegen geplant werden, den Beitrag jedes Jahr um ca. 2% p.a. (oder jedes zweite Jahr um ca. 4% p.a.) zu erhöhen. Falls die 2% p.a. Inflation wirklich eintritt, würde die Dynamik aber für die Schließung der Lücke nicht reichen. Im Erstbeitrag ist deswegen bereits ein ''Sicherheitspuffer'' berücksichtigt, damit künftige Beitragserhöhungen moderater ausfallen können."}]
[null,null,null,{"$f":"D23","v":"Basisrente"},{"$f":"E23","v":"Riesterrente"},"Privatrente"]
[{"$f":"A24","v":"Kapitalbedarf ohne Inflation"},null,null,{"$f":"D24","v":335000},{"$f":"E24","v":335000},270000]
[{"$f":"A25","v":"Zins"},null,null,{"$f":"D25","v":{"$error":"#NUM!"}},{"$error":"#NUM!"},{"$error":"#NUM!"}]
["Beitrag (Brutto) ohne Inflation mtl.",null,null,{"$error":"#NUM!"},{"$error":"#NUM!"},{"$error":"#NUM!"}]
[]
["Dynamik",null,null,{"$f":"D12","v":0.02},{"$f":"D41","v":0.02},{"$f":"E41","v":0.02}]
["Anfangsbeitrag (Brutto)",null,null,{"$f":"'Inflation Berechnung'!G15","v":241.50291908898075},{"$f":"'Inflation Berechnung'!I15","v":3059.4997174451751},{"$f":"'Inflation Berechnung'!K15","v":193.92323950727106}]
["Endbeitrag (Brutto)",null,null,{"$f":"'Inflation Berechnung'!G75","v":732.03526492696585},{"$f":"'Inflation Berechnung'!I75","v":9273.8493375260568},{"$f":"'Inflation Berechnung'!K75","v":587.81339183687635}]
[]
[]
["3) Dynamischer Beitrag"]
["Bei dieser Herangehensweise wird davon ausgegangen, dass der Beitrag jährlich entsprechend der tatsächlichen Inflation angepasst wird. Die Inflation wird beim Anfangsbeitrag nicht berücksichtigt!\nACHTUNG:   Die Beitragsanpassung muss größer als die Inflationsrate sein!"]
[]
[null,null,null,{"$f":"D36","v":"Basisrente"},{"$f":"E36","v":"Riesterrente"},"Privatrente"]
[{"$f":"A37","v":"Kapitalbedarf ohne Inflation"},null,null,{"$f":"D37","v":335000},{"$f":"E37","v":335000},270000]
[{"$f":"A38","v":"Zins"},null,null,{"$f":"D38","v":{"$error":"#NUM!"}},{"$error":"#NUM!"},{"$error":"#NUM!"}]
["Beitrag (Brutto) ohne Inflation mtl.",null,null,{"$f":"D39","v":{"$error":"#NUM!"}},{"$error":"#NUM!"},{"$error":"#NUM!"}]
[]
["Dynamik p.a.",null,null,{"$f":"'Inflation Berechnung'!O8","v":0.1072642672716565},{"$f":"'Inflation Berechnung'!Q8","v":4.1544996217823274E-2},{"$f":"'Inflation Berechnung'!S8","v":0.10726426727165658}]
["Inflation p.a.",null,null,{"$f":"'Inflation Berechnung'!B1","v":0.02},{"$f":"D55","v":0.02},{"$f":"D55","v":0.02}]
["Endbeitrag (Brutto) mtl. ",null,null,{"$f":"'Inflation Berechnung'!O75","v":{"$error":"#NUM!"}},{"$f":"'Inflation Berechnung'!Q75","v":{"$error":"#NUM!"}},{"$f":"'Inflation Berechnung'!S75","v":{"$error":"#NUM!"}}]
[]
["Die verschiendenen Beitragsverläufe sind in der folgenden Grafik am Beispiel der Privatrente aufgezeigt."]
[]
[null,null,null,null,null,null,{"$f":"F56","v":{"$error":"#NUM!"}}]
[]
[null,null,null,null,null,null,{"$f":"F43","v":587.81339183687635}]
[]
[null,null,null,null,null,null,{"$f":"F29","v":{"$error":"#NUM!"}}]
[]
[]
[{"$f":"'Inflation Berechnung'!B21","v":{"$error":"#NUM!"}}]
[]
[{"$f":"'Inflation Berechnung'!C21","v":193.92323950727106}]
[]
[{"$f":"'Inflation Berechnung'!D21","v":{"$error":"#NUM!"}}]
[]
[]
[]
["Quelle: Eigene Berechnungen auf Basis Ihrer Angaben und der gesetzlichen Daten.",null,null,null,null,{"$f":"\"1 / \"&Variablen!B1&\"\"","v":"1 / 2022"}]
["Für die Richtigkeit der Angaben kann keine Gewähr übernommen werden, denn Programm- und Berechnungsfehler sind trotz sorgfältigstem Vorgehen nicht ausgeschlossen.                                                                          "]

{"sheet":"Inflation Berechnung","index":7,"n_rows":80,"n_cols":20,"rows_kept":80,"cut":false,"hidden":true,"merged":[[9,0,9,3],[9,5,9,11],[18,0,18,3],[9,13,9,19],[10,14,10,15],[10,10,10,11],[10,8,10,9],[10,6,10,7],[10,16,10,17],[10,18,10,19]]}
["Inflation",{"$f":"Inflation!D11","v":0.02}]
["Laufzeit",{"$f":"Variablen!B15","v":57}]
["gew. Dynamik",{"$f":"Inflation!D12","v":0.02}]
[]
[]
[]
[]
[null,null,null,null,null,null,null,null,null,null,null,null,null,"Dynamik:",0.1072642672716565,null,4.1544996217823274E-2,null,0.10726426727165658]
[null,null,null,null,null,null,null,null,null,null,null,null,null,"Keine negative Dynamik",{"$f":"MAX(O8,0)","v":0.1072642672716565},null,{"$f":"MAX(Q8,0)","v":4.1544996217823274E-2},null,{"$f":"MAX(S8,0)","v":0.10726426727165658}]
["Konstanter Beitrag",null,null,null,null,"Teildynamischer Beitrag",null,null,null,null,null,null,null,"Dynamischer Beitrag"]
[null,"Basisrente","Riesterrente","Privatrente",null,null,"Basisrente",null,"Riesterrente",null,"Privatrente",null,null,null,"Basisrente",null,"Riesterrente",null,"Privatrente"]
["Kapitalbedarf ohne Inflation",{"$f":"'Schichtennavigator Ausgabe'!C20","v":335000},{"$f":"'Schichtennavigator Ausgabe'!D20","v":335000},{"$f":"'Schichtennavigator Ausgabe'!E20","v":270000},null,"Kapitalbedarf ohne Inflation",{"$f":"B16","v":1035749.1783914296},null,null,{"$f":"C16","v":1035749.1783914296},null,{"$f":"D16","v":834782.91989757016},null,"Kapitalbedarf ohne Inflation",{"$f":"G12","v":1035749.1783914296},null,null,{"$f":"J12","v":1035749.1783914296},null,834782.91989757016]
["Zins",{"$f":"'Schichtennavigator Ausgabe'!C19","v":{"$error":"#NUM!"}},{"$f":"'Schichtennavigator Ausgabe'!D19","v":{"$error":"#NUM!"}},{"$f":"'Schichtennavigator Ausgabe'!E19","v":{"$error":"#NUM!"}},null,"Zielwertsuche",{"$f":"VLOOKUP(B2,F15:L74,3)","v":{"$error":"#NUM!"}},null,null,{"$f":"VLOOKUP(B2,F15:L74,5)","v":{"$error":"#NUM!"}},null,{"$f":"VLOOKUP(B2,F15:L74,7)","v":{"$error":"#NUM!"}},null,"Zielwertsuche",{"$f":"VLOOKUP(B2,N15:T74,3)","v":{"$error":"#NUM!"}},null,null,{"$f":"VLOOKUP(B2,N15:T74,5)","v":{"$error":"#NUM!"}},null,{"$f":"VLOOKUP(B2,N15:T74,7)","v":{"$error":"#NUM!"}}]
["Beitrag (Brutto) ohne Inflation mtl.",{"$f":"'Schichtennavigator Ausgabe'!C18","v":{"$error":"#NUM!"}},{"$f":"'Schichtennavigator Ausgabe'!D18","v":{"$error":"#NUM!"}},{"$f":"'Schichtennavigator Ausgabe'!E18","v":{"$error":"#NUM!"}},null,"Laufzeit","Beitrag","Gesamt Basisrente","Beitrag Riester","Gesamt Riesterrente","Beitrag Privat","Gesamt Privatrente",null,"Laufzeit","Beitrag","Gesamt Basisrente","Beitrag Riester","Gesamt Riesterrente","Beitrag Privat","Gesamt Privatrente"]
[null,null,null,null,null,1,241.50291908898075,{"$f":"G15*12*(1+$B$13)","v":{"$error":"#NUM!"}},3059.4997174451751,{"$f":"I15*12*(1+$C$13)","v":{"$error":"#NUM!"}},193.92323950727106,{"$f":"K15*12*(1+$D$13)","v":{"$error":"#NUM!"}},null,1,{"$f":"B14","v":{"$error":"#NUM!"}},{"$f":"O15*12*(1+$B$13)","v":{"$error":"#NUM!"}},{"$f":"C14","v":{"$error":"#NUM!"}},{"$f":"Q15*12*(1+$C$13)","v":{"$error":"#NUM!"}},{"$f":"D14","v":{"$error":"#NUM!"}},{"$f":"S15*12*(1+$D$13)","v":{"$error":"#NUM!"}}]
["Kapitalbedarf mit Inflation",{"$f":"B12*(1+$B$1)^$B$2","v":1035749.1783914296},{"$f":"C12*(1+$B$1)^$B$2","v":1035749.1783914296},834782.91989757016,null,{"$f":"F15+1","v":2},{"$f":"G15*(1+$B$3)","v":246.33297747076037},{"$f":"(H15+G16*12)*(1+$B$13)","v":{"$error":"#NUM!"}},{"$f":"I15*(1+$B$1)","v":3120.6897117940784},{"$f":"(J15+I16*12)*(1+$C$13)","v":{"$error":"#NUM!"}},{"$f":"K15*(1+$B$1)","v":197.80170429741648},{"$f":"(L15+K16*12)*(1+$D$13)","v":{"$error":"#NUM!"}},null,{"$f":"N15+1","v":2},{"$f":"O15*(1+$O$9)","v":{"$error":"#NUM!"}},{"$f":"(P15+O16*12)*(1+$B$13)","v":{"$error":"#NUM!"}},{"$f":"MAX(Q15*(1+$Q$9),0)","v":{"$error":"#NUM!"}},{"$f":"(R15+Q16*12)*(1+$C$13)","v":{"$error":"#NUM!"}},{"$f":"S15*(1+$S$9)","v":{"$error":"#NUM!"}},{"$f":"(T15+S16*12)*(1+$D$13)","v":{"$error":"#NUM!"}}]
["Beitrag (Brutto) mit Inflation mtl.",{"$f":"-PMT(B13/12,$B$2*12,0,B16)","v":{"$error":"#NUM!"}},{"$f":"-PMT(C13/12,$B$2*12,0,C16)","v":{"$error":"#NUM!"}},{"$error":"#NUM!"},null,{"$f":"F16+1","v":3},{"$f":"G16*(1+$B$3)","v":251.25963702017557},{"$f":"(H16+G17*12)*(1+$B$13)","v":{"$error":"#NUM!"}},{"$f":"I16*(1+$B$1)","v":3183.10350602996},{"$f":"(J16+I17*12)*(1+$C$13)","v":{"$error":"#NUM!"}},{"$f":"K16*(1+$B$1)","v":201.75773838336482},{"$f":"(L16+K17*12)*(1+$D$13)","v":{"$error":"#NUM!"}},null,{"$f":"N16+1","v":3},{"$f":"O16*(1+$O$9)","v":{"$error":"#NUM!"}},{"$f":"(P16+O17*12)*(1+$B$13)","v":{"$error":"#NUM!"}},{"$f":"MAX(Q16*(1+$Q$9),0)","v":{"$error":"#NUM!"}},{"$f":"(R16+Q17*12)*(1+$C$13)","v":{"$error":"#NUM!"}},{"$f":"S16*(1+$S$9)","v":{"$error":"#NUM!"}},{"$f":"(T16+S17*12)*(1+$D$13)","v":{"$error":"#NUM!"}}]
[null,null,null,null,null,4,{"$f":"G17*(1+$B$3)","v":256.2848297605791},{"$error":"#NUM!"},3246.7655761505594,{"$error":"#NUM!"},205.79289315103213,{"$error":"#NUM!"},null,4,{"$error":"#NUM!"},{"$error":"#NUM!"},{"$error":"#NUM!"},{"$error":"#NUM!"},{"$error":"#NUM!"},{"$error":"#NUM!"}]
["Grafik",null,null,null,null,5,261.41052635579069,{"$error":"#NUM!"},3311.7008876735704,{"$error":"#NUM!"},209.90875101405277,{"$error":"#NUM!"},null,5,{"$error":"#NUM!"},{"$error":"#NUM!"},{"$error":"#NUM!"},{"$error":"#NUM!"},{"$error":"#NUM!"},{"$error":"#NUM!"}]
["Alter","Konstanter Beitrag","Teildynamischer Beitrag","Dynamischer Beitrag",null,6,266.63873688290653,{"$error":"#NUM!"},3377.9349054270419,{"$error":"#NUM!"},214.10692603433384,{"$error":"#NUM!"},null,6,{"$error":"#NUM!"},{"$error":"#NUM!"},{"$error":"#NUM!"},{"$error":"#NUM!"},{"$error":"#NUM!"},{"$error":"#NUM!"}]
[{"$f":"Eingabe!C9","v":10},{"$f":"D17","v":{"$error":"#NUM!"}},{"$f":"K15","v":193.92323950727106},{"$f":"S15","v":{"$error":"#NUM!"}},null,7,271.97151162056468,{"$error":"#NUM!"},3445.4936035355827,{"$error":"#NUM!"},218.38906455502052,{"$error":"#NUM!"},null,7,{"$error":"#NUM!"},{"$error":"#NUM!"},{"$error":"#NUM!"},{"$error":"#NUM!"},{"$error":"#NUM!"},{"$error":"#NUM!"}]
[{"$f":"IF(A21+1>Eingabe!$C$10,#N/A,A21+1)","v":11},{"$f":"IF(A22>Eingabe!$C$10,#N/A,B21)","v":{"$error":"#NUM!"}},{"$f":"IF(A22>Eingabe!$C$10,#N/A,K16)","v":197.80170429741648},{"$f":"IF(A22>Eingabe!$C$10,#N/A,S16)","v":{"$error":"#NUM!"}},null,8,277.41094185297601,{"$error":"#NUM!"},3514.4034756062943,{"$error":"#NUM!"},222.75684584612094,{"$error":"#NUM!"},null,8,{"$error":"#NUM!"},{"$error":"#NUM!"},{"$error":"#NUM!"},{"$error":"#NUM!"},{"$error":"#NUM!"},{"$error":"#NUM!"}]
[{"$f":"IF(A22+1>Eingabe!$C$10,#N/A,A22+1)","v":12},{"$f":"IF(A23>Eingabe!$C$10,#N/A,B22)","v":{"$error":"#NUM!"}},{"$f":"IF(A23>Eingabe!$C$10,#N/A,K17)","v":201.75773838336482},{"$f":"IF(A23>Eingabe!$C$10,#N/A,S17)","v":{"$error":"#NUM!"}},null,9,282.95916069003556,{"$error":"#NUM!"},3584.69154511842,{"$error":"#NUM!"},227.21198276304335,{"$error":"#NUM!"},null,9,{"$error":"#NUM!"},{"$error":"#NUM!"},{"$error":"#NUM!"},{"$error":"#NUM!"},{"$error":"#NUM!"},{"$error":"#NUM!"}]
[{"$f":"IF(A23+1>Eingabe!$C$10,#N/A,A23+1)","v":13},{"$f":"IF(A24>Eingabe!$C$10,#N/A,B23)","v":{"$error":"#NUM!"}},{"$f":"IF(A24>Eingabe!$C$10,#N/A,K18)","v":205.79289315103213},{"$f":"IF(A24>Eingabe!$C$10,#N/A,S18)","v":{"$error":"#NUM!"}},null,10,288.61834390383626,{"$error":"#NUM!"},3656.3853760207885,{"$error":"#NUM!"},231.75622241830422,{"$error":"#NUM!"},null,10,{"$error":"#NUM!"},{"$error":"#NUM!"},{"$error":"#NUM!"},{"$error":"#NUM!"},{"$error":"#NUM!"},{"$error":"#NUM!"}]
[{"$f":"IF(A24+1>Eingabe!$C$10,#N/A,A24+1)","v":14},{"$f":"IF(A25>Eingabe!$C$10,#N/A,B24)","v":{"$error":"#NUM!"}},{"$f":"IF(A25>Eingabe!$C$10,#N/A,K19)","v":209.90875101405277},{"$f":"IF(A25>Eingabe!$C$10,#N/A,S19)","v":{"$error":"#NUM!"}},null,11,294.39071078191301,{"$error":"#NUM!"},3729.5130835412042,{"$error":"#NUM!"},236.39134686667032,{"$error":"#NUM!"},null,11,{"$error":"#NUM!"},{"$error":"#NUM!"},{"$error":"#NUM!"},{"$error":"#NUM!"},{"$error":"#NUM!"},{"$error":"#NUM!"}]
[{"$f":"IF(A25+1>Eingabe!$C$10,#N/A,A25+1)","v":15},{"$f":"IF(A26>Eingabe!$C$10,#N/A,B25)","v":{"$error":"#NUM!"}},{"$f":"IF(A26>Eingabe!$C$10,#N/A,K20)","v":214.10692603433384},{"$f":"IF(A26>Eingabe!$C$10,#N/A,S20)","v":{"$error":"#NUM!"}},null,12,300.2785249975513,{"$error":"#NUM!"},3804.1033452120282,{"$error":"#NUM!"},241.11917380400374,{"$error":"#NUM!"},null,12,{"$error":"#NUM!"},{"$error":"#NUM!"},{"$error":"#NUM!"},{"$error":"#NUM!"},{"$error":"#NUM!"},{"$error":"#NUM!"}]
[{"$f":"IF(A26+1>Eingabe!$C$10,#N/A,A26+1)","v":16},{"$f":"IF(A27>Eingabe!$C$10,#N/A,B26)","v":{"$error":"#NUM!"}},{"$f":"IF(A27>Eingabe!$C$10,#N/A,K21)","v":218.38906455502052},{"$f":"IF(A27>Eingabe!$C$10,#N/A,S21)","v":{"$error":"#NUM!"}},null,13,306.28409549750234,{"$error":"#NUM!"},3880.1854121162687,{"$error":"#NUM!"},245.94155728008383,{"$error":"#NUM!"},null,13,{"$error":"#NUM!"},{"$error":"#NUM!"},{"$error":"#NUM!"},{"$error":"#NUM!"},{"$error":"#NUM!"},{"$error":"#NUM!"}]
[{"$f":"IF(A27+1>Eingabe!$C$10,#N/A,A27+1)","v":17},{"$f":"IF(A28>Eingabe!$C$10,#N/A,B27)","v":{"$error":"#NUM!"}},{"$f":"IF(A28>Eingabe!$C$10,#N/A,K22)","v":222.75684584612094},{"$f":"IF(A28>Eingabe!$C$10,#N/A,S22)","v":{"$error":"#NUM!"}},null,14,312.4097774074524,{"$error":"#NUM!"},3957.7891203585941,{"$error":"#NUM!"},250.8603884256855,{"$error":"#NUM!"},null,14,{"$error":"#NUM!"},{"$error":"#NUM!"},{"$error":"#NUM!"},{"$error":"#NUM!"},{"$error":"#NUM!"},{"$error":"#NUM!"}]
[{"$f":"IF(A28+1>Eingabe!$C$10,#N/A,A28+1)","v":18},{"$f":"IF(A29>Eingabe!$C$10,#N/A,B28)","v":{"$error":"#NUM!"}},{"$f":"IF(A29>Eingabe!$C$10,#N/A,K23)","v":227.21198276304335},{"$f":"IF(A29>Eingabe!$C$10,#N/A,S23)","v":{"$error":"#NUM!"}},null,15,318.65797295560145,{"$error":"#NUM!"},4036.9449027657661,{"$error":"#NUM!"},255.87759619419921,{"$error":"#NUM!"},null,15,{"$error":"#NUM!"},{"$error":"#NUM!"},{"$error":"#NUM!"},{"$error":"#NUM!"},{"$error":"#NUM!"},{"$error":"#NUM!"}]
[{"$f":"IF(A29+1>Eingabe!$C$10,#N/A,A29+1)","v":19},{"$f":"IF(A30>Eingabe!$C$10,#N/A,B29)","v":{"$error":"#NUM!"}},{"$f":"IF(A30>Eingabe!$C$10,#N/A,K24)","v":231.75622241830422},{"$f":"IF(A30>Eingabe!$C$10,#N/A,S24)","v":{"$error":"#NUM!"}},null,16,325.03113241471351,{"$error":"#NUM!"},4117.6838008210816,{"$error":"#NUM!"},260.99514811808319,{"$error":"#NUM!"},null,16,{"$error":"#NUM!"},{"$error":"#NUM!"},{"$error":"#NUM!"},{"$error":"#NUM!"},{"$error":"#NUM!"},{"$error":"#NUM!"}]
[{"$f":"IF(A30+1>Eingabe!$C$10,#N/A,A30+1)","v":20},{"$f":"IF(A31>Eingabe!$C$10,#N/A,B30)","v":{"$error":"#NUM!"}},{"$f":"IF(A31>Eingabe!$C$10,#N/A,K25)","v":236.39134686667032},{"$f":"IF(A31>Eingabe!$C$10,#N/A,S25)","v":{"$error":"#NUM!"}},null,17,331.53175506300778,{"$error":"#NUM!"},4200.0374768375032,{"$error":"#NUM!"},266.21505108044488,{"$error":"#NUM!"},null,17,{"$error":"#NUM!"},{"$error":"#NUM!"},{"$error":"#NUM!"},{"$error":"#NUM!"},{"$error":"#NUM!"},{"$error":"#NUM!"}]
[{"$f":"IF(A31+1>Eingabe!$C$10,#N/A,A31+1)","v":21},{"$f":"IF(A32>Eingabe!$C$10,#N/A,B31)","v":{"$error":"#NUM!"}},{"$f":"IF(A32>Eingabe!$C$10,#N/A,K26)","v":241.11917380400374},{"$f":"IF(A32>Eingabe!$C$10,#N/A,S26)","v":{"$error":"#NUM!"}},null,18,338.16239016426795,{"$error":"#NUM!"},4284.0382263742531,{"$error":"#NUM!"},271.53935210205378,{"$error":"#NUM!"},null,18,{"$error":"#NUM!"},{"$error":"#NUM!"},{"$error":"#NUM!"},{"$error":"#NUM!"},{"$error":"#NUM!"},{"$error":"#NUM!"}]
[{"$f":"IF(A32+1>Eingabe!$C$10,#N/A,A32+1)","v":22},{"$f":"IF(A33>Eingabe!$C$10,#N/A,B32)","v":{"$error":"#NUM!"}},{"$f":"IF(A33>Eingabe!$C$10,#N/A,K27)","v":245.94155728008383},{"$f":"IF(A33>Eingabe!$C$10,#N/A,S27)","v":{"$error":"#NUM!"}},null,19,344.92563796755331,{"$error":"#NUM!"},4369.7189909017379,{"$error":"#NUM!"},276.97013914409484,{"$error":"#NUM!"},null,19,{"$error":"#NUM!"},{"$error":"#NUM!"},{"$error":"#NUM!"},{"$error":"#NUM!"},{"$error":"#NUM!"},{"$error":"#NUM!"}]
[{"$f":"IF(A33+1>Eingabe!$C$10,#N/A,A33+1)","v":23},{"$f":"IF(A34>Eingabe!$C$10,#N/A,B33)","v":{"$error":"#NUM!"}},{"$f":"IF(A34>Eingabe!$C$10,#N/A,K28)","v":250.8603884256855},{"$f":"IF(A34>Eingabe!$C$10,#N/A,S28)","v":{"$error":"#NUM!"}},null,20,351.82415072690441,{"$error":"#NUM!"},4457.1133707197723,{"$error":"#NUM!"},282.50954192697674,{"$error":"#NUM!"},null,20,{"$error":"#NUM!"},{"$error":"#NUM!"},{"$error":"#NUM!"},{"$error":"#NUM!"},{"$error":"#NUM!"},{"$error":"#NUM!"}]
[{"$f":"IF(A34+1>Eingabe!$C$10,#N/A,A34+1)","v":24},{"$f":"IF(A35>Eingabe!$C$10,#N/A,B34)","v":{"$error":"#NUM!"}},{"$f":"IF(A35>Eingabe!$C$10,#N/A,K29)","v":255.87759619419921},{"$f":"IF(A35>Eingabe!$C$10,#N/A,S29)","v":{"$error":"#NUM!"}},null,21,358.86063374144248,{"$error":"#NUM!"},4546.2556381341683,{"$error":"#NUM!"},288.15973276551625,{"$error":"#NUM!"},null,21,{"$error":"#NUM!"},{"$error":"#NUM!"},{"$error":"#NUM!"},{"$error":"#NUM!"},{"$error":"#NUM!"},{"$error":"#NUM!"}]
[{"$f":"IF(A35+1>Eingabe!$C$10,#N/A,A35+1)","v":25},{"$f":"IF(A36>Eingabe!$C$10,#N/A,B35)","v":{"$error":"#NUM!"}},{"$f":"IF(A36>Eingabe!$C$10,#N/A,K30)","v":260.99514811808319},{"$f":"IF(A36>Eingabe!$C$10,#N/A,S30)","v":{"$error":"#NUM!"}},null,22,366.03784641627135,{"$error":"#NUM!"},4637.1807508968514,{"$error":"#NUM!"},293.92292742082657,{"$error":"#NUM!"},null,22,{"$error":"#NUM!"},{"$error":"#NUM!"},{"$error":"#NUM!"},{"$error":"#NUM!"},{"$error":"#NUM!"},{"$error":"#NUM!"}]
[{"$f":"IF(A36+1>Eingabe!$C$10,#N/A,A36+1)","v":26},{"$f":"IF(A37>Eingabe!$C$10,#N/A,B36)","v":{"$error":"#NUM!"}},{"$f":"IF(A37>Eingabe!$C$10,#N/A,K31)","v":266.21505108044488},{"$f":"IF(A37>Eingabe!$C$10,#N/A,S31)","v":{"$error":"#NUM!"}},null,23,373.35860334459676,{"$error":"#NUM!"},4729.9243659147887,{"$error":"#NUM!"},299.80138596924309,{"$error":"#NUM!"},null,23,{"$error":"#NUM!"},{"$error":"#NUM!"},{"$error":"#NUM!"},{"$error":"#NUM!"},{"$error":"#NUM!"},{"$error":"#NUM!"}]
[{"$f":"IF(A37+1>Eingabe!$C$10,#N/A,A37+1)","v":27},{"$f":"IF(A38>Eingabe!$C$10,#N/A,B37)","v":{"$error":"#NUM!"}},{"$f":"IF(A38>Eingabe!$C$10,#N/A,K32)","v":271.53935210205378},{"$f":"IF(A38>Eingabe!$C$10,#N/A,S32)","v":{"$error":"#NUM!"}},null,24,380.82577541148868,{"$error":"#NUM!"},4824.5228532330848,{"$error":"#NUM!"},305.79741368862796,{"$error":"#NUM!"},null,24,{"$error":"#NUM!"},{"$error":"#NUM!"},{"$error":"#NUM!"},{"$error":"#NUM!"},{"$error":"#NUM!"},{"$error":"#NUM!"}]
[{"$f":"IF(A38+1>Eingabe!$C$10,#N/A,A38+1)","v":28},{"$f":"IF(A39>Eingabe!$C$10,#N/A,B38)","v":{"$error":"#NUM!"}},{"$f":"IF(A39>Eingabe!$C$10,#N/A,K33)","v":276.97013914409484},{"$f":"IF(A39>Eingabe!$C$10,#N/A,S33)","v":{"$error":"#NUM!"}},null,25,388.44229091971846,{"$error":"#NUM!"},4921.013310297747,{"$error":"#NUM!"},311.91336196240053,{"$error":"#NUM!"},null,25,{"$error":"#NUM!"},{"$error":"#NUM!"},{"$error":"#NUM!"},{"$error":"#NUM!"},{"$error":"#NUM!"},{"$error":"#NUM!"}]
[{"$f":"IF(A39+1>Eingabe!$C$10,#N/A,A39+1)","v":29},{"$f":"IF(A40>Eingabe!$C$10,#N/A,B39)","v":{"$error":"#NUM!"}},{"$f":"IF(A40>Eingabe!$C$10,#N/A,K34)","v":282.50954192697674},{"$f":"IF(A40>Eingabe!$C$10,#N/A,S34)","v":{"$error":"#NUM!"}},null,26,396.21113673811283,{"$error":"#NUM!"},5019.4335765037022,{"$error":"#NUM!"},318.15162920164852,{"$error":"#NUM!"},null,26,{"$error":"#NUM!"},{"$error":"#NUM!"},{"$error":"#NUM!"},{"$error":"#NUM!"},{"$error":"#NUM!"},{"$error":"#NUM!"}]
[{"$f":"IF(A40+1>Eingabe!$C$10,#N/A,A40+1)","v":30},{"$f":"IF(A41>Eingabe!$C$10,#N/A,B40)","v":{"$error":"#NUM!"}},{"$f":"IF(A41>Eingabe!$C$10,#N/A,K35)","v":288.15973276551625},{"$f":"IF(A41>Eingabe!$C$10,#N/A,S35)","v":{"$error":"#NUM!"}},null,27,404.13535947287511,{"$error":"#NUM!"},5119.8222480337763,{"$error":"#NUM!"},324.51466178568148,{"$error":"#NUM!"},null,27,{"$error":"#NUM!"},{"$error":"#NUM!"},{"$error":"#NUM!"},{"$error":"#NUM!"},{"$error":"#NUM!"},{"$error":"#NUM!"}]
[{"$f":"IF(A41+1>Eingabe!$C$10,#N/A,A41+1)","v":31},{"$f":"IF(A42>Eingabe!$C$10,#N/A,B41)","v":{"$error":"#NUM!"}},{"$f":"IF(A42>Eingabe!$C$10,#N/A,K36)","v":293.92292742082657},{"$f":"IF(A42>Eingabe!$C$10,#N/A,S36)","v":{"$error":"#NUM!"}},null,28,{"$f":"G41*(1+$B$1)","v":412.2180666623326},{"$error":"#NUM!"},5222.2186929944519,{"$error":"#NUM!"},331.00495502139512,{"$error":"#NUM!"},null,28,{"$error":"#NUM!"},{"$error":"#NUM!"},{"$error":"#NUM!"},{"$error":"#NUM!"},{"$error":"#NUM!"},{"$error":"#NUM!"}]
[{"$f":"IF(A42+1>Eingabe!$C$10,#N/A,A42+1)","v":32},{"$f":"IF(A43>Eingabe!$C$10,#N/A,B42)","v":{"$error":"#NUM!"}},{"$f":"IF(A43>Eingabe!$C$10,#N/A,K37)","v":299.80138596924309},{"$f":"IF(A43>Eingabe!$C$10,#N/A,S37)","v":{"$error":"#NUM!"}},null,29,420.46242799557928,{"$error":"#NUM!"},5326.6630668543412,{"$error":"#NUM!"},337.62505412182304,{"$error":"#NUM!"},null,29,{"$error":"#NUM!"},{"$error":"#NUM!"},{"$error":"#NUM!"},{"$error":"#NUM!"},{"$error":"#NUM!"},{"$error":"#NUM!"}]
[{"$f":"IF(A43+1>Eingabe!$C$10,#N/A,A43+1)","v":33},{"$f":"IF(A44>Eingabe!$C$10,#N/A,B43)","v":{"$error":"#NUM!"}},{"$f":"IF(A44>Eingabe!$C$10,#N/A,K38)","v":305.79741368862796},{"$f":"IF(A44>Eingabe!$C$10,#N/A,S38)","v":{"$error":"#NUM!"}},null,30,428.87167655549086,{"$error":"#NUM!"},5433.1963281914277,{"$error":"#NUM!"},344.37755520425952,{"$error":"#NUM!"},null,30,{"$error":"#NUM!"},{"$error":"#NUM!"},{"$error":"#NUM!"},{"$error":"#NUM!"},{"$error":"#NUM!"},{"$error":"#NUM!"}]
[{"$f":"IF(A44+1>Eingabe!$C$10,#N/A,A44+1)","v":34},{"$f":"IF(A45>Eingabe!$C$10,#N/A,B44)","v":{"$error":"#NUM!"}},{"$f":"IF(A45>Eingabe!$C$10,#N/A,K39)","v":311.91336196240053},{"$f":"IF(A45>Eingabe!$C$10,#N/A,S39)","v":{"$error":"#NUM!"}},null,31,437.44911008660068,{"$error":"#NUM!"},5541.8602547552564,{"$error":"#NUM!"},351.26510630834474,{"$error":"#NUM!"},null,31,{"$error":"#NUM!"},{"$error":"#NUM!"},{"$error":"#NUM!"},{"$error":"#NUM!"},{"$error":"#NUM!"},{"$error":"#NUM!"}]
[{"$f":"IF(A45+1>Eingabe!$C$10,#N/A,A45+1)","v":35},{"$f":"IF(A46>Eingabe!$C$10,#N/A,B45)","v":{"$error":"#NUM!"}},{"$f":"IF(A46>Eingabe!$C$10,#N/A,K40)","v":318.15162920164852},{"$f":"IF(A46>Eingabe!$C$10,#N/A,S40)","v":{"$error":"#NUM!"}},null,32,446.1980922883327,{"$error":"#NUM!"},5652.6974598503621,{"$error":"#NUM!"},358.29040843451162,{"$error":"#NUM!"},null,32,{"$error":"#NUM!"},{"$error":"#NUM!"},{"$error":"#NUM!"},{"$error":"#NUM!"},{"$error":"#NUM!"},{"$error":"#NUM!"}]
[{"$f":"IF(A46+1>Eingabe!$C$10,#N/A,A46+1)","v":36},{"$f":"IF(A47>Eingabe!$C$10,#N/A,B46)","v":{"$error":"#NUM!"}},{"$f":"IF(A47>Eingabe!$C$10,#N/A,K41)","v":324.51466178568148},{"$f":"IF(A47>Eingabe!$C$10,#N/A,S41)","v":{"$error":"#NUM!"}},null,33,455.12205413409936,{"$error":"#NUM!"},5765.7514090473696,{"$error":"#NUM!"},365.45621660320188,{"$error":"#NUM!"},null,33,{"$error":"#NUM!"},{"$error":"#NUM!"},{"$error":"#NUM!"},{"$error":"#NUM!"},{"$error":"#NUM!"},{"$error":"#NUM!"}]
[{"$f":"IF(A47+1>Eingabe!$C$10,#N/A,A47+1)","v":37},{"$f":"IF(A48>Eingabe!$C$10,#N/A,B47)","v":{"$error":"#NUM!"}},{"$f":"IF(A48>Eingabe!$C$10,#N/A,K42)","v":331.00495502139512},{"$f":"IF(A48>Eingabe!$C$10,#N/A,S42)","v":{"$error":"#NUM!"}},null,34,464.22449521678135,{"$error":"#NUM!"},5881.0664372283172,{"$error":"#NUM!"},372.7653409352659,{"$error":"#NUM!"},null,34,{"$error":"#NUM!"},{"$error":"#NUM!"},{"$error":"#NUM!"},{"$error":"#NUM!"},{"$error":"#NUM!"},{"$error":"#NUM!"}]
[{"$f":"IF(A48+1>Eingabe!$C$10,#N/A,A48+1)","v":38},{"$f":"IF(A49>Eingabe!$C$10,#N/A,B48)","v":{"$error":"#NUM!"}},{"$f":"IF(A49>Eingabe!$C$10,#N/A,K43)","v":337.62505412182304},{"$f":"IF(A49>Eingabe!$C$10,#N/A,S43)","v":{"$error":"#NUM!"}},null,35,473.50898512111701,{"$error":"#NUM!"},5998.6877659728834,{"$error":"#NUM!"},380.22064775397121,{"$error":"#NUM!"},null,35,{"$error":"#NUM!"},{"$error":"#NUM!"},{"$error":"#NUM!"},{"$error":"#NUM!"},{"$error":"#NUM!"},{"$error":"#NUM!"}]
[{"$f":"IF(A49+1>Eingabe!$C$10,#N/A,A49+1)","v":39},{"$f":"IF(A50>Eingabe!$C$10,#N/A,B49)","v":{"$error":"#NUM!"}},{"$f":"IF(A50>Eingabe!$C$10,#N/A,K44)","v":344.37755520425952},{"$f":"IF(A50>Eingabe!$C$10,#N/A,S44)","v":{"$error":"#NUM!"}},null,36,482.97916482353935,{"$error":"#NUM!"},6118.6615212923416,{"$error":"#NUM!"},387.82506070905066,{"$error":"#NUM!"},null,36,{"$error":"#NUM!"},{"$error":"#NUM!"},{"$error":"#NUM!"},{"$error":"#NUM!"},{"$error":"#NUM!"},{"$error":"#NUM!"}]
[{"$f":"IF(A50+1>Eingabe!$C$10,#N/A,A50+1)","v":40},{"$f":"IF(A51>Eingabe!$C$10,#N/A,B50)","v":{"$error":"#NUM!"}},{"$f":"IF(A51>Eingabe!$C$10,#N/A,K45)","v":351.26510630834474},{"$f":"IF(A51>Eingabe!$C$10,#N/A,S45)","v":{"$error":"#NUM!"}},null,37,492.63874812001012,{"$error":"#NUM!"},6241.0347517181881,{"$error":"#NUM!"},395.58156192323167,{"$error":"#NUM!"},null,37,{"$error":"#NUM!"},{"$error":"#NUM!"},{"$error":"#NUM!"},{"$error":"#NUM!"},{"$error":"#NUM!"},{"$error":"#NUM!"}]
[{"$f":"IF(A51+1>Eingabe!$C$10,#N/A,A51+1)","v":41},{"$f":"IF(A52>Eingabe!$C$10,#N/A,B51)","v":{"$error":"#NUM!"}},{"$f":"IF(A52>Eingabe!$C$10,#N/A,K46)","v":358.29040843451162},{"$f":"IF(A52>Eingabe!$C$10,#N/A,S46)","v":{"$error":"#NUM!"}},null,38,502.49152308241031,{"$error":"#NUM!"},6365.8554467525519,{"$error":"#NUM!"},403.4931931616963,{"$error":"#NUM!"},null,38,{"$error":"#NUM!"},{"$error":"#NUM!"},{"$error":"#NUM!"},{"$error":"#NUM!"},{"$error":"#NUM!"},{"$error":"#NUM!"}]
[{"$f":"IF(A52+1>Eingabe!$C$10,#N/A,A52+1)","v":42},{"$f":"IF(A53>Eingabe!$C$10,#N/A,B52)","v":{"$error":"#NUM!"}},{"$f":"IF(A53>Eingabe!$C$10,#N/A,K47)","v":365.45621660320188},{"$f":"IF(A53>Eingabe!$C$10,#N/A,S47)","v":{"$error":"#NUM!"}},null,39,512.54135354405855,{"$error":"#NUM!"},6493.1725556876027,{"$error":"#NUM!"},411.56305702493023,{"$error":"#NUM!"},null,39,{"$error":"#NUM!"},{"$error":"#NUM!"},{"$error":"#NUM!"},{"$error":"#NUM!"},{"$error":"#NUM!"},{"$error":"#NUM!"}]
[{"$f":"IF(A53+1>Eingabe!$C$10,#N/A,A53+1)","v":43},{"$f":"IF(A54>Eingabe!$C$10,#N/A,B53)","v":{"$error":"#NUM!"}},{"$f":"IF(A54>Eingabe!$C$10,#N/A,K48)","v":372.7653409352659},{"$f":"IF(A54>Eingabe!$C$10,#N/A,S48)","v":{"$error":"#NUM!"}},null,40,522.79218061493975,{"$error":"#NUM!"},6623.0360068013551,{"$error":"#NUM!"},419.79431816542882,{"$error":"#NUM!"},null,40,{"$error":"#NUM!"},{"$error":"#NUM!"},{"$error":"#NUM!"},{"$error":"#NUM!"},{"$error":"#NUM!"},{"$error":"#NUM!"}]
[{"$f":"IF(A54+1>Eingabe!$C$10,#N/A,A54+1)","v":44},{"$f":"IF(A55>Eingabe!$C$10,#N/A,B54)","v":{"$error":"#NUM!"}},{"$f":"IF(A55>Eingabe!$C$10,#N/A,K49)","v":380.22064775397121},{"$f":"IF(A55>Eingabe!$C$10,#N/A,S49)","v":{"$error":"#NUM!"}},null,41,533.2480242272386,{"$error":"#NUM!"},6755.4967269373819,{"$error":"#NUM!"},428.19020452873741,{"$error":"#NUM!"},null,41,{"$f":"O54*(1+$O$8)","v":{"$error":"#NUM!"}},{"$error":"#NUM!"},{"$f":"MAX(Q54*(1+$Q$8),0)","v":{"$error":"#NUM!"}},{"$error":"#NUM!"},{"$f":"S54*(1+$S$8)","v":{"$error":"#NUM!"}},{"$error":"#NUM!"}]
[{"$f":"IF(A55+1>Eingabe!$C$10,#N/A,A55+1)","v":45},{"$f":"IF(A56>Eingabe!$C$10,#N/A,B55)","v":{"$error":"#NUM!"}},{"$f":"IF(A56>Eingabe!$C$10,#N/A,K50)","v":387.82506070905066},{"$f":"IF(A56>Eingabe!$C$10,#N/A,S50)","v":{"$error":"#NUM!"}},null,42,543.91298471178334,{"$error":"#NUM!"},6890.6066614761294,{"$error":"#NUM!"},436.75400861931217,{"$error":"#NUM!"},null,42,{"$error":"#NUM!"},{"$error":"#NUM!"},{"$error":"#NUM!"},{"$error":"#NUM!"},{"$error":"#NUM!"},{"$error":"#NUM!"}]
[{"$f":"IF(A56+1>Eingabe!$C$10,#N/A,A56+1)","v":46},{"$f":"IF(A57>Eingabe!$C$10,#N/A,B56)","v":{"$error":"#NUM!"}},{"$f":"IF(A57>Eingabe!$C$10,#N/A,K51)","v":395.58156192323167},{"$f":"IF(A57>Eingabe!$C$10,#N/A,S51)","v":{"$error":"#NUM!"}},null,43,554.79124440601902,{"$error":"#NUM!"},7028.4187947056516,{"$error":"#NUM!"},445.48908879169841,{"$error":"#NUM!"},null,43,{"$f":"O56*(1+$O$8)","v":{"$error":"#NUM!"}},{"$error":"#NUM!"},{"$f":"Q56*(1+$Q$8)","v":{"$error":"#NUM!"}},{"$error":"#NUM!"},{"$error":"#NUM!"},{"$f":"(T56+S57*12)*(1+$D$13)","v":{"$error":"#NUM!"}}]
[{"$f":"IF(A57+1>Eingabe!$C$10,#N/A,A57+1)","v":47},{"$f":"IF(A58>Eingabe!$C$10,#N/A,B57)","v":{"$error":"#NUM!"}},{"$f":"IF(A58>Eingabe!$C$10,#N/A,K52)","v":403.4931931616963},{"$f":"IF(A58>Eingabe!$C$10,#N/A,S52)","v":{"$error":"#NUM!"}},null,44,565.88706929413945,{"$error":"#NUM!"},7168.9871705997648,{"$error":"#NUM!"},454.39887056753236,{"$error":"#NUM!"},null,44,{"$error":"#NUM!"},{"$error":"#NUM!"},{"$error":"#NUM!"},{"$error":"#NUM!"},{"$error":"#NUM!"},{"$error":"#NUM!"}]
[{"$f":"IF(A58+1>Eingabe!$C$10,#N/A,A58+1)","v":48},{"$f":"IF(A59>Eingabe!$C$10,#N/A,B58)","v":{"$error":"#NUM!"}},{"$f":"IF(A59>Eingabe!$C$10,#N/A,K53)","v":411.56305702493023},{"$f":"IF(A59>Eingabe!$C$10,#N/A,S53)","v":{"$error":"#NUM!"}},null,45,577.20481068002221,{"$error":"#NUM!"},7312.3669140117599,{"$error":"#NUM!"},463.48684797888302,{"$error":"#NUM!"},null,45,{"$error":"#NUM!"},{"$error":"#NUM!"},{"$error":"#NUM!"},{"$error":"#NUM!"},{"$error":"#NUM!"},{"$error":"#NUM!"}]
[{"$f":"IF(A59+1>Eingabe!$C$10,#N/A,A59+1)","v":49},{"$f":"IF(A60>Eingabe!$C$10,#N/A,B59)","v":{"$error":"#NUM!"}},{"$f":"IF(A60>Eingabe!$C$10,#N/A,K54)","v":419.79431816542882},{"$f":"IF(A60>Eingabe!$C$10,#N/A,S54)","v":{"$error":"#NUM!"}},null,46,588.74890689362269,{"$error":"#NUM!"},7458.6142522919954,{"$error":"#NUM!"},472.75658493846066,{"$error":"#NUM!"},null,46,{"$error":"#NUM!"},{"$error":"#NUM!"},{"$error":"#NUM!"},{"$error":"#NUM!"},{"$error":"#NUM!"},{"$error":"#NUM!"}]
[{"$f":"IF(A60+1>Eingabe!$C$10,#N/A,A60+1)","v":50},{"$f":"IF(A61>Eingabe!$C$10,#N/A,B60)","v":{"$error":"#NUM!"}},{"$f":"IF(A61>Eingabe!$C$10,#N/A,K55)","v":428.19020452873741},{"$f":"IF(A61>Eingabe!$C$10,#N/A,S55)","v":{"$error":"#NUM!"}},null,47,600.52388503149518,{"$error":"#NUM!"},7607.7865373378354,{"$error":"#NUM!"},482.21171663722987,{"$error":"#NUM!"},null,47,{"$error":"#NUM!"},{"$error":"#NUM!"},{"$error":"#NUM!"},{"$error":"#NUM!"},{"$error":"#NUM!"},{"$error":"#NUM!"}]
[{"$f":"IF(A61+1>Eingabe!$C$10,#N/A,A61+1)","v":51},{"$f":"IF(A62>Eingabe!$C$10,#N/A,B61)","v":{"$error":"#NUM!"}},{"$f":"IF(A62>Eingabe!$C$10,#N/A,K56)","v":436.75400861931217},{"$f":"IF(A62>Eingabe!$C$10,#N/A,S56)","v":{"$error":"#NUM!"}},null,48,612.53436273212515,{"$error":"#NUM!"},7759.9422680845919,{"$error":"#NUM!"},491.85595096997446,{"$error":"#NUM!"},null,48,{"$error":"#NUM!"},{"$error":"#NUM!"},{"$error":"#NUM!"},{"$error":"#NUM!"},{"$error":"#NUM!"},{"$error":"#NUM!"}]
[{"$f":"IF(A62+1>Eingabe!$C$10,#N/A,A62+1)","v":52},{"$f":"IF(A63>Eingabe!$C$10,#N/A,B62)","v":{"$error":"#NUM!"}},{"$f":"IF(A63>Eingabe!$C$10,#N/A,K57)","v":445.48908879169841},{"$f":"IF(A63>Eingabe!$C$10,#N/A,S57)","v":{"$error":"#NUM!"}},null,49,624.7850499867676,{"$error":"#NUM!"},7915.1411134462842,{"$error":"#NUM!"},501.69306998937395,{"$error":"#NUM!"},null,49,{"$error":"#NUM!"},{"$error":"#NUM!"},{"$error":"#NUM!"},{"$error":"#NUM!"},{"$error":"#NUM!"},{"$error":"#NUM!"}]
[{"$f":"IF(A63+1>Eingabe!$C$10,#N/A,A63+1)","v":53},{"$f":"IF(A64>Eingabe!$C$10,#N/A,B63)","v":{"$error":"#NUM!"}},{"$f":"IF(A64>Eingabe!$C$10,#N/A,K58)","v":454.39887056753236},{"$f":"IF(A64>Eingabe!$C$10,#N/A,S58)","v":{"$error":"#NUM!"}},null,50,637.28075098650299,{"$error":"#NUM!"},8073.4439357152096,{"$error":"#NUM!"},511.72693138916145,{"$error":"#NUM!"},null,50,{"$error":"#NUM!"},{"$error":"#NUM!"},{"$error":"#NUM!"},{"$error":"#NUM!"},{"$error":"#NUM!"},{"$error":"#NUM!"}]
[{"$f":"IF(A64+1>Eingabe!$C$10,#N/A,A64+1)","v":54},{"$f":"IF(A65>Eingabe!$C$10,#N/A,B64)","v":{"$error":"#NUM!"}},{"$f":"IF(A65>Eingabe!$C$10,#N/A,K59)","v":463.48684797888302},{"$f":"IF(A65>Eingabe!$C$10,#N/A,S59)","v":{"$error":"#NUM!"}},null,51,650.02636600623305,{"$error":"#NUM!"},8234.9128144295137,{"$error":"#NUM!"},521.96147001694465,{"$error":"#NUM!"},null,51,{"$error":"#NUM!"},{"$error":"#NUM!"},{"$error":"#NUM!"},{"$error":"#NUM!"},{"$error":"#NUM!"},{"$error":"#NUM!"}]
[{"$f":"IF(A65+1>Eingabe!$C$10,#N/A,A65+1)","v":55},{"$f":"IF(A66>Eingabe!$C$10,#N/A,B65)","v":{"$error":"#NUM!"}},{"$f":"IF(A66>Eingabe!$C$10,#N/A,K60)","v":472.75658493846066},{"$f":"IF(A66>Eingabe!$C$10,#N/A,S60)","v":{"$error":"#NUM!"}},null,52,663.02689332635771,{"$error":"#NUM!"},8399.6110707181033,{"$error":"#NUM!"},532.40069941728359,{"$error":"#NUM!"},null,52,{"$error":"#NUM!"},{"$error":"#NUM!"},{"$error":"#NUM!"},{"$error":"#NUM!"},{"$error":"#NUM!"},{"$error":"#NUM!"}]
[{"$f":"IF(A66+1>Eingabe!$C$10,#N/A,A66+1)","v":56},{"$f":"IF(A67>Eingabe!$C$10,#N/A,B66)","v":{"$error":"#NUM!"}},{"$f":"IF(A67>Eingabe!$C$10,#N/A,K61)","v":482.21171663722987},{"$f":"IF(A67>Eingabe!$C$10,#N/A,S61)","v":{"$error":"#NUM!"}},null,53,676.28743119288492,{"$error":"#NUM!"},8567.6032921324659,{"$error":"#NUM!"},543.04871340562931,{"$error":"#NUM!"},null,53,{"$error":"#NUM!"},{"$error":"#NUM!"},{"$error":"#NUM!"},{"$error":"#NUM!"},{"$error":"#NUM!"},{"$error":"#NUM!"}]
[{"$f":"IF(A67+1>Eingabe!$C$10,#N/A,A67+1)","v":57},{"$f":"IF(A68>Eingabe!$C$10,#N/A,B67)","v":{"$error":"#NUM!"}},{"$f":"IF(A68>Eingabe!$C$10,#N/A,K62)","v":491.85595096997446},{"$f":"IF(A68>Eingabe!$C$10,#N/A,S62)","v":{"$error":"#NUM!"}},null,54,689.8131798167426,{"$error":"#NUM!"},8738.9553579751155,{"$error":"#NUM!"},553.90968767374193,{"$error":"#NUM!"},null,54,{"$error":"#NUM!"},{"$error":"#NUM!"},{"$error":"#NUM!"},{"$error":"#NUM!"},{"$error":"#NUM!"},{"$error":"#NUM!"}]
[{"$f":"IF(A68+1>Eingabe!$C$10,#N/A,A68+1)","v":58},{"$f":"IF(A69>Eingabe!$C$10,#N/A,B68)","v":{"$error":"#NUM!"}},{"$f":"IF(A69>Eingabe!$C$10,#N/A,K63)","v":501.69306998937395},{"$f":"IF(A69>Eingabe!$C$10,#N/A,S63)","v":{"$error":"#NUM!"}},null,55,703.60944341307743,{"$error":"#NUM!"},8913.7344651346175,{"$error":"#NUM!"},564.98788142721673,{"$error":"#NUM!"},null,55,{"$error":"#NUM!"},{"$error":"#NUM!"},{"$error":"#NUM!"},{"$error":"#NUM!"},{"$error":"#NUM!"},{"$error":"#NUM!"}]
[{"$f":"IF(A69+1>Eingabe!$C$10,#N/A,A69+1)","v":59},{"$f":"IF(A70>Eingabe!$C$10,#N/A,B69)","v":{"$error":"#NUM!"}},{"$f":"IF(A70>Eingabe!$C$10,#N/A,K64)","v":511.72693138916145},{"$f":"IF(A70>Eingabe!$C$10,#N/A,S64)","v":{"$error":"#NUM!"}},null,56,717.68163228133903,{"$error":"#NUM!"},9092.0091544373099,{"$error":"#NUM!"},576.28763905576113,{"$error":"#NUM!"},null,56,{"$error":"#NUM!"},{"$error":"#NUM!"},{"$error":"#NUM!"},{"$error":"#NUM!"},{"$error":"#NUM!"},{"$error":"#NUM!"}]
[{"$f":"IF(A70+1>Eingabe!$C$10,#N/A,A70+1)","v":60},{"$f":"IF(A71>Eingabe!$C$10,#N/A,B70)","v":{"$error":"#NUM!"}},{"$f":"IF(A71>Eingabe!$C$10,#N/A,K65)","v":521.96147001694465},{"$f":"IF(A71>Eingabe!$C$10,#N/A,S65)","v":{"$error":"#NUM!"}},null,57,732.03526492696585,{"$error":"#NUM!"},9273.8493375260568,{"$error":"#NUM!"},587.81339183687635,{"$error":"#NUM!"},null,57,{"$error":"#NUM!"},{"$error":"#NUM!"},{"$error":"#NUM!"},{"$error":"#NUM!"},{"$error":"#NUM!"},{"$error":"#NUM!"}]
[{"$f":"IF(A71+1>Eingabe!$C$10,#N/A,A71+1)","v":61},{"$f":"IF(A72>Eingabe!$C$10,#N/A,B71)","v":{"$error":"#NUM!"}},{"$f":"IF(A72>Eingabe!$C$10,#N/A,K66)","v":532.40069941728359},{"$f":"IF(A72>Eingabe!$C$10,#N/A,S66)","v":{"$error":"#NUM!"}},null,58,746.67597022550513,{"$error":"#NUM!"},9459.3263242765788,{"$error":"#NUM!"},599.56965967361384,{"$error":"#NUM!"},null,58,{"$error":"#NUM!"},{"$error":"#NUM!"},{"$error":"#NUM!"},{"$error":"#NUM!"},{"$error":"#NUM!"},{"$error":"#NUM!"}]
[{"$f":"IF(A72+1>Eingabe!$C$10,#N/A,A72+1)","v":62},{"$f":"IF(A73>Eingabe!$C$10,#N/A,B72)","v":{"$error":"#NUM!"}},{"$f":"IF(A73>Eingabe!$C$10,#N/A,K67)","v":543.04871340562931},{"$f":"IF(A73>Eingabe!$C$10,#N/A,S67)","v":{"$error":"#NUM!"}},null,59,761.60948963001522,{"$error":"#NUM!"},9648.5128507621102,{"$error":"#NUM!"},611.56105286708612,{"$error":"#NUM!"},null,59,{"$error":"#NUM!"},{"$error":"#NUM!"},{"$error":"#NUM!"},{"$error":"#NUM!"},{"$error":"#NUM!"},{"$error":"#NUM!"}]
[{"$f":"IF(A73+1>Eingabe!$C$10,#N/A,A73+1)","v":63},{"$f":"IF(A74>Eingabe!$C$10,#N/A,B73)","v":{"$error":"#NUM!"}},{"$f":"IF(A74>Eingabe!$C$10,#N/A,K68)","v":553.90968767374193},{"$f":"IF(A74>Eingabe!$C$10,#N/A,S68)","v":{"$error":"#NUM!"}},null,60,776.84167942261558,{"$error":"#NUM!"},9841.4831077773524,{"$error":"#NUM!"},623.79227392442783,{"$error":"#NUM!"},null,60,{"$error":"#NUM!"},{"$error":"#NUM!"},{"$error":"#NUM!"},{"$error":"#NUM!"},{"$f":"S73*(1+$S$8)","v":{"$error":"#NUM!"}},{"$error":"#NUM!"}]
[{"$f":"IF(A74+1>Eingabe!$C$10,#N/A,A74+1)","v":64},{"$f":"IF(A75>Eingabe!$C$10,#N/A,B74)","v":{"$error":"#NUM!"}},{"$f":"IF(A75>Eingabe!$C$10,#N/A,K69)","v":564.98788142721673},{"$f":"IF(A75>Eingabe!$C$10,#N/A,S69)","v":{"$error":"#NUM!"}},null,"Endbeitrag",{"$f":"VLOOKUP(B2,F15:G74,2)","v":732.03526492696585},null,{"$f":"VLOOKUP(B2,F15:I74,4)","v":9273.8493375260568},null,{"$f":"VLOOKUP(B2,F15:K74,6)","v":587.81339183687635},null,null,"Endbeitrag",{"$f":"VLOOKUP(B2,N15:T74,2)","v":{"$error":"#NUM!"}},null,{"$f":"VLOOKUP(B2,N15:T74,4)","v":{"$error":"#NUM!"}},null,{"$f":"VLOOKUP(B2,N15:T74,6)","v":{"$error":"#NUM!"}}]
[{"$f":"IF(A75+1>Eingabe!$C$10,#N/A,A75+1)","v":65},{"$f":"IF(A76>Eingabe!$C$10,#N/A,B75)","v":{"$error":"#NUM!"}},{"$f":"IF(A76>Eingabe!$C$10,#N/A,K70)","v":576.28763905576113},{"$f":"IF(A76>Eingabe!$C$10,#N/A,S70)","v":{"$error":"#NUM!"}}]
[{"$f":"IF(A76+1>Eingabe!$C$10,#N/A,A76+1)","v":66},{"$f":"IF(A77>Eingabe!$C$10,#N/A,B76)","v":{"$error":"#NUM!"}},{"$f":"IF(A77>Eingabe!$C$10,#N/A,K71)","v":587.81339183687635},{"$f":"IF(A77>Eingabe!$C$10,#N/A,S71)","v":{"$error":"#NUM!"}}]
[{"$f":"IF(A77+1>Eingabe!$C$10,#N/A,A77+1)","v":67},{"$f":"IF(A78>Eingabe!$C$10,#N/A,B77)","v":{"$error":"#NUM!"}},{"$f":"IF(A78>Eingabe!$C$10,#N/A,K72)","v":599.56965967361384},{"$f":"IF(A78>Eingabe!$C$10,#N/A,S72)","v":{"$error":"#NUM!"}},null,{"$f":"IF(P35+1>Eingabe!$G$8,#N/A,E36)","v":{"$error":"#NUM!"}}]
[{"$f":"IF(A78+1>Eingabe!$C$10,#N/A,A78+1)","v":{"$error":"#N/A"}},{"$f":"IF(A79>Eingabe!$C$10,#N/A,B78)","v":{"$error":"#N/A"}},{"$f":"IF(A79>Eingabe!$C$10,#N/A,K73)","v":{"$error":"#N/A"}},{"$f":"IF(A79>Eingabe!$C$10,#N/A,S73)","v":{"$error":"#N/A"}}]
[{"$f":"IF(A79+1>Eingabe!$C$10,#N/A,A79+1)","v":{"$error":"#N/A"}},{"$f":"IF(A80>Eingabe!$C$10,#N/A,B79)","v":{"$error":"#N/A"}},{"$f":"IF(A80>Eingabe!$C$10,#N/A,K74)","v":{"$error":"#N/A"}},{"$f":"IF(A80>Eingabe!$C$10,#N/A,S74)","v":{"$error":"#N/A"}}]

{"sheet":"Ruhestandsplanung","index":8,"n_rows":24,"n_cols":10,"rows_kept":24,"cut":false,"hidden":true,"merged":[[13,0,13,3],[17,0,17,3],[18,4,18,5],[5,9,6,12],[13,4,13,5],[15,0,15,3],[15,4,15,5],[8,0,8,3],[7,0,7,3],[7,4,7,5],[8,4,8,5],[7,6,8,7],[20,0,20,3],[20,4,20,5],[19,0,19,3],[19,9,21,14],[3,0,3,7],[5,0,5,7],[14,0,14,3],[14,4,14,5],[18,0,18,3],[17,4,17,5],[10,0,10,3],[10,4,10,5],[11,0,11,3],[11,4,11,5],[12,0,12,3],[12,4,12,5],[22,0,22,3],[22,4,22,5],[21,0,21,3],[21,4,21,5],[23,9,26,14]]}
[]
[]
[]
[{"$f":"IF(YEAR(TODAY())=Variablen!B1,\"Ruhestandsplanung\",\"Das Tool ist abgelaufen!\")","v":"Ruhestandsplanung"}]
[]
["Eingaben",null,null,null,null,null,null,null,null,{"$f":"IF('Ruhestandsplanung Berechnung'!AI5>=E8,\"Wunschrente ist zum Rentenbeginn                       erreicht!\",\"Wunschrente ist zum Rentenbeginn                        NICHT erreicht!\")","v":"Wunschrente ist zum Rentenbeginn                       erreicht!"}]
[]
["Wunschrente (Netto) inkl. KV-Bedarf - siehe Eingabe",null,null,null,{"$f":"Eingabe!E14+Eingabe!E30","v":0},null,{"$f":"\"Oft sind es 70% = \"&FIXED(E8*0.7,0)&\" EUR der Wunschrente\"","v":"Oft sind es 70% = 0 EUR der Wunschrente"}]
["Notwendige Rente für das Existenzminimum",null,null,null,{"$f":"E8*0.7","v":0}]
[null,null,null,null,null,null,"(Renten-) Steigerung"]
["Gesetzliche Rente / Versorgungswerk (Brutto)",null,null,null,{"$f":"Eingabe!E16","v":2000},null,5.0000000000000001E-3]
["Basisrente (Brutto)",null,null,null,{"$f":"Eingabe!E17","v":0},null,1.2999999999999999E-2]
["Riesterrente (Brutto)",null,null,null,{"$f":"Eingabe!E18","v":0},null,0.01]
["betriebliche Altersversorgung (Brutto)",null,null,null,{"$f":"Eingabe!E19","v":0},null,1.2999999999999999E-2]
["Mieteinkünfte (Brutto)",null,null,null,{"$f":"Eingabe!E20","v":0},null,1.4999999999999999E-2]
["Sonstige Renten mit Ertragsanteil (Brutto)",null,null,null,{"$f":"Eingabe!E21","v":0},null,1.2999999999999999E-2]
[]
["Verfügbares liquides Kapitalvermögen / Neuanlage",null,null,null,{"$f":"Eingabe!E24","v":0}]
["Daraus resultierende Kapitalrente  (Brutto) ca.",null,null,null,{"$f":"ROUND(E18/Variablen!E11,0)","v":0},null,1.2999999999999999E-2]
["(ACHTUNG: Simulation mit einer klassischen Verrentung!)",null,null,null,null,null,null,null,null,{"$f":"IF('Ruhestandsplanung Berechnung'!AI5>=E8,\"\",\"Es fehlen netto \"&FIXED(E8-'Ruhestandsplanung Berechnung'!AI5,0)&\" EUR mtl. oder liquides Kapital von ca. \"&FIXED(Variablen!E34,0)&\" EUR im Alter von \"&Eingabe!C10&\" Jahren auf Basis der klassischen Verrentung!\")","v":""}]
["Inflation",null,null,null,{"$f":"Inflation!D11","v":0.02}]
["Rendite (nach Kosten) bei einem Auszahlplan",null,null,null,0.05]
["Übernahme Schichtennavigator / Neuanlage",null,null,null,1.06]
[null,null,null,null,null,null,null,null,null,{"$f":"IF('Ruhestandsplanung Berechnung'!AS35<=0,\"Über einen Auszahlplan mit  \"&FIXED(Ruhestandsplanung!E22*100,2)&\" % kann für mind. 30 Jahre die dynamische Rentenlücke geschlossen werden.\",\"Für die Absicherung der dynamischen Rentenlücke in den Rentenphase als Auszahlplan bis zum Alter \"&FIXED('Ruhestandsplanung Berechnung'!A35,0)&\" benötigen Sie zusätzlich \"&FIXED(Variablen!E35,0)&\" EUR.\")","v":"Über einen Auszahlplan mit  5,00 % kann für mind. 30 Jahre die dynamische Rentenlücke geschlossen werden."}]

{"sheet":"Ruhestandsplanung Berechnung","index":9,"n_rows":72,"n_cols":51,"rows_kept":72,"cut":false,"hidden":true,"merged":[[64,0,64,2],[1,37,1,38],[2,7,2,10],[2,3,2,6],[2,11,2,14],[2,15,2,18],[2,19,2,22],[2,23,2,26],[2,27,2,30],[2,31,2,34],[64,11,64,14]]}
["Rentenbeginn",{"$f":"Eingabe!$C$10","v":67},null,"Steuerpflichtig Schicht 1",{"$f":"Variablen!M3","v":1},null,null,null,null,null,null,null,null,null,null,null,null,null,null,null,null,null,null,"Ertragsanteil",{"$f":"Variablen!I2","v":0.17}]
[null,null,null,null,null,null,null,null,null,null,null,null,null,null,null,null,null,null,null,null,null,null,null,null,null,null,null,null,null,null,null,null,null,null,null,null,null,"Kapital für Entnahmeplan:",null,{"$f":"Ruhestandsplanung!E18","v":0},null,null,null,null,null,null,"Steuer bei Komplettschließung"]
["Alter","Wunschrente (Netto)","Existenzrente (Netto)","Gesetzliche Rente / Versorgungswerk",null,null,null,"Basisrente",null,null,null,"Riesterrente",null,null,null,"betriebliche Altersversorgung",null,null,null,"Mieteinkünfte",null,null,null,"Sonstige Renten",null,null,null,"Kapitalrente",null,null,null,"Gesamteinkommen (Netto)",null,null,null,null,"Gesamt ohne Kapitalrente","Kapial ","Entnahme","Zins","Steuer","Gesamt","Gesamteinkommen (Netto)","Lücke","Kapital dyn. Lücke",null,"Lücke","Steuer-pflichtig","Steuer gesamt","Steuer Zusatzrente","Prozentsatz"]
[null,null,null,"Brutto Rente","Steuerpflichtig","Steuer","Netto-Rente","Brutto Rente","Steuerpflichtig","Steuer","Netto-Rente","Brutto Rente","Steuerpflichtig","Steuer","Netto-Rente","Brutto Rente","Steuerpflichtig","Steuer","Netto-Rente","Brutto Rente","Steuerpflichtig","Steuer","Netto-Rente","Brutto Rente","Steuerpflichtig","Steuer","Netto-Rente","Brutto Rente","Steuerpflichtig","Steuer","Netto-Rente","Brutto Rente","Steuerpflichtig","Steuer","Netto-Rente",null,"Netto",null,"Netto"]
[{"$f":"B1","v":67},{"$f":"Ruhestandsplanung!E8","v":0},{"$f":"Ruhestandsplanung!E9","v":0},{"$f":"Ruhestandsplanung!E11","v":2000},{"$f":"D5*$E$1","v":2000},{"$f":"IF(AG5=0,0,AH5/AG5*E5)","v":71.623804262399986},{"$f":"D5-F5","v":1928.3761957376},{"$f":"Ruhestandsplanung!E12","v":0},{"$f":"H5*$E$1","v":0},{"$f":"IF(AG5=0,0,AH5/AG5*I5)","v":0},{"$f":"H5-J5","v":0},{"$f":"Ruhestandsplanung!E13","v":0},{"$f":"L5","v":0},{"$f":"IF(AG5=0,0,AH5/AG5*M5)","v":0},{"$f":"L5-N5","v":0},{"$f":"Ruhestandsplanung!E14","v":0},{"$f":"P5","v":0},{"$f":"IF(AG5=0,0,AH5/AG5*Q5)","v":0},{"$f":"P5-R5","v":0},{"$f":"Ruhestandsplanung!E15","v":0},{"$f":"T5","v":0},{"$f":"IF(AG5=0,0,AH5/AG5*U5)","v":0},{"$f":"T5-V5","v":0},{"$f":"Ruhestandsplanung!E16","v":0},{"$f":"X5*$Y$1","v":0},{"$f":"IF(AG5=0,0,AH5/AG5*Y5)","v":0},{"$f":"X5-Z5","v":0},{"$f":"Ruhestandsplanung!E19","v":0},{"$f":"AB5*$Y$1","v":0},{"$f":"IF(AG5=0,0,AH5*AC5/AG5)","v":0},{"$f":"AB5-AD5","v":0},{"$f":"D5+H5+L5+P5+T5+X5+AB5","v":2000},{"$f":"E5+I5+M5+Q5+U5+Y5+AC5","v":2000},{"$f":"steuer(Variablen!$B$3,AG5*12)/12","v":71.623804262399986},{"$f":"AF5-AH5","v":1928.3761957376},null,{"$f":"G5+K5+O5+S5+W5+AA5","v":1928.3761957376},{"$f":"AN2","v":0},{"$f":"MAX(B5-AK5,0)","v":0},{"$f":"(AL5-(AM5*12))*Ruhestandsplanung!$E$22","v":0},{"$f":"steuer(Variablen!$B$3,AG5*12+AN5)/12-AH5","v":0},{"$f":"AL5-AM5*12+AN5-AO5","v":0},{"$f":"AK5+AM5","v":1928.3761957376},{"$f":"B5-AQ5","v":-1928.3761957376},{"$f":"(SUM($AR4:AR$5)*12)*(1/((1+Ruhestandsplanung!$E$22)^(A5-'Ruhestandsplanung Berechnung'!$A$5)))","v":-23140.5143488512},null,{"$f":"MAX(0,Ruhestandsplanung!E8-G5-K5-O5-S5-W5-AA5)","v":0},{"$f":"AU5*Y1","v":0},{"$f":"steuer(Variablen!$B$3,(AG5+AV5)*12)/12","v":71.623804262399986},{"$f":"AW5-AH5","v":0},{"$f":"ROUNDUP(IF('Ruhestandsplanung Berechnung'!AU5=0,0,('Ruhestandsplanung Berechnung'!AX5/'Ruhestandsplanung Berechnung'!AU5)),2)","v":0}]
[{"$f":"A5+1","v":68},{"$f":"B5*(1+Ruhestandsplanung!$E$21)","v":0},{"$f":"C5*(1+Ruhestandsplanung!$E$21)","v":0},{"$f":"D5*(1+Ruhestandsplanung!$G$11)","v":2009.9999999999998},{"$f":"D6*$E$1","v":2009.9999999999998},{"$f":"IF(AG6=0,0,AH6/AG6*E6)","v":73.545692386399992},{"$f":"D6-F6","v":1936.4543076135997},{"$f":"H5*(1+Ruhestandsplanung!$G$12)","v":0},{"$f":"H6*$E$1","v":0},{"$f":"IF(AG6=0,0,AH6/AG6*I6)","v":0},{"$f":"H6-J6","v":0},{"$f":"L5*(1+Ruhestandsplanung!$G$13)","v":0},{"$f":"L6","v":0},{"$f":"IF(AG6=0,0,AH6/AG6*M6)","v":0},{"$f":"L6-N6","v":0},{"$f":"P5*(1+Ruhestandsplanung!$G$14)","v":0},{"$f":"P6","v":0},{"$f":"IF(AG6=0,0,AH6/AG6*Q6)","v":0},{"$f":"P6-R6","v":0},{"$f":"T5*(1+Ruhestandsplanung!$G$15)","v":0},{"$f":"T6","v":0},{"$f":"IF(AG6=0,0,AH6/AG6*U6)","v":0},{"$f":"T6-V6","v":0},{"$f":"X5*(1+Ruhestandsplanung!$G$16)","v":0},{"$f":"X6*$Y$1","v":0},{"$f":"IF(AG6=0,0,AH6/AG6*Y6)","v":0},{"$f":"X6-Z6","v":0},{"$f":"AB5*(1+Ruhestandsplanung!$G$19)","v":0},{"$f":"AB6*$Y$1","v":0},{"$f":"IF(AG6=0,0,AH6*AC6/AG6)","v":0},{"$f":"AB6-AD6","v":0},{"$f":"D6+H6+L6+P6+T6+X6+AB6","v":2009.9999999999998},{"$f":"E6+I6+M6+Q6+U6+Y6+AC6","v":2009.9999999999998},{"$f":"steuer(Variablen!$B$3,AG6*12)/12","v":73.545692386399992},{"$f":"AF6-AH6","v":1936.4543076135997},null,{"$f":"G6+K6+O6+S6+W6+AA6","v":1936.4543076135997},{"$f":"IF(AP5<=0,0,AP5)","v":0},{"$f":"MAX(MIN(IF(AL6=0,0,MAX(B6-AK6,0)),AP5),0)","v":0},{"$f":"(AL6-(AM6*12))*Ruhestandsplanung!$E$22","v":0},{"$f":"steuer(Variablen!$B$3,AG6*12+AN6)/12-AH6","v":0},{"$f":"AL6-AM6*12+AN6-AO6","v":0},{"$f":"AK6+AM6","v":1936.4543076135997},{"$f":"B6-AQ6","v":-1936.4543076135997},{"$f":"(SUM($AR$5:AR5)*12)*(1/((1+Ruhestandsplanung!$E$22)^(A6-'Ruhestandsplanung Berechnung'!$A$5)))","v":-22038.585094144}]
[{"$f":"A6+1","v":69},{"$f":"B6*(1+Ruhestandsplanung!$E$21)","v":0},{"$f":"C6*(1+Ruhestandsplanung!$E$21)","v":0},{"$f":"D6*(1+Ruhestandsplanung!$G$11)","v":2020.0499999999995},{"$f":"D7*$E$1","v":2020.0499999999995},75.48922218920147,{"$f":"D7-F7","v":1944.5607778107981},{"$f":"H6*(1+Ruhestandsplanung!$G$12)","v":0},0,0,0,{"$f":"L6*(1+Ruhestandsplanung!$G$13)","v":0},0,0,0,{"$f":"P6*(1+Ruhestandsplanung!$G$14)","v":0},0,0,0,{"$f":"T6*(1+Ruhestandsplanung!$G$15)","v":0},0,0,0,{"$f":"X6*(1+Ruhestandsplanung!$G$16)","v":0},0,0,0,{"$f":"AB6*(1+Ruhestandsplanung!$G$19)","v":0},0,0,0,2020.0499999999995,2020.0499999999995,{"$f":"steuer(Variablen!$B$3,AG7*12)/12","v":75.48922218920147},1944.5607778107981,null,1944.5607778107981,{"$f":"IF(AP6<=0,0,AP6)","v":0},{"$f":"MAX(MIN(IF(AL7=0,0,MAX(B7-AK7,0)),AP6),0)","v":0},{"$f":"(AL7-(AM7*12))*Ruhestandsplanung!$E$22","v":0},{"$f":"steuer(Variablen!$B$3,AG7*12+AN7)/12-AH7","v":0},{"$f":"AL7-AM7*12+AN7-AO7","v":0},1944.5607778107981,-1944.5607778107981,{"$f":"(SUM($AR$5:AR6)*12)*(1/((1+Ruhestandsplanung!$E$22)^(A7-'Ruhestandsplanung Berechnung'!$A$5)))","v":-42066.182349400806}]
[70,{"$f":"B7*(1+Ruhestandsplanung!$E$21)","v":0},{"$f":"C7*(1+Ruhestandsplanung!$E$21)","v":0},{"$f":"D7*(1+Ruhestandsplanung!$G$11)","v":2030.1502499999992},2030.1502499999992,77.454573704293509,1952.6956762957057,{"$f":"H7*(1+Ruhestandsplanung!$G$12)","v":0},0,0,0,{"$f":"L7*(1+Ruhestandsplanung!$G$13)","v":0},0,0,0,{"$f":"P7*(1+Ruhestandsplanung!$G$14)","v":0},0,0,0,{"$f":"T7*(1+Ruhestandsplanung!$G$15)","v":0},0,0,0,{"$f":"X7*(1+Ruhestandsplanung!$G$16)","v":0},0,0,0,{"$f":"AB7*(1+Ruhestandsplanung!$G$19)","v":0},0,0,0,2030.1502499999992,2030.1502499999992,{"$f":"steuer(Variablen!$B$3,AG8*12)/12","v":77.454573704293509},1952.6956762957057,null,1952.6956762957057,{"$f":"IF(AP7<=0,0,AP7)","v":0},0,{"$f":"(AL8-(AM8*12))*Ruhestandsplanung!$E$22","v":0},{"$f":"steuer(Variablen!$B$3,AG8*12+AN8)/12-AH8","v":0},{"$f":"AL8-AM8*12+AN8-AO8","v":0},1952.6956762957057,-1952.6956762957057,{"$f":"(SUM($AR$5:AR7)*12)*(1/((1+Ruhestandsplanung!$E$22)^(A8-'Ruhestandsplanung Berechnung'!$A$5)))","v":-60220.4473589841}]
[71,{"$f":"B8*(1+Ruhestandsplanung!$E$21)","v":0},{"$f":"C8*(1+Ruhestandsplanung!$E$21)","v":0},{"$f":"D8*(1+Ruhestandsplanung!$G$11)","v":2040.301001249999},2040.301001249999,79.442255201889779,1960.8587460481092,{"$f":"H8*(1+Ruhestandsplanung!$G$12)","v":0},0,0,0,{"$f":"L8*(1+Ruhestandsplanung!$G$13)","v":0},0,0,0,{"$f":"P8*(1+Ruhestandsplanung!$G$14)","v":0},0,0,0,{"$f":"T8*(1+Ruhestandsplanung!$G$15)","v":0},0,0,0,{"$f":"X8*(1+Ruhestandsplanung!$G$16)","v":0},0,0,0,{"$f":"AB8*(1+Ruhestandsplanung!$G$19)","v":0},0,0,0,2040.301001249999,2040.301001249999,{"$f":"steuer(Variablen!$B$3,AG9*12)/12","v":79.442255201889779},1960.8587460481092,null,1960.8587460481092,0,0,{"$f":"(AL9-(AM9*12))*Ruhestandsplanung!$E$22","v":0},{"$f":"steuer(Variablen!$B$3,AG9*12+AN9)/12-AH9","v":0},{"$f":"AL9-AM9*12+AN9-AO9","v":0},1960.8587460481092,-1960.8587460481092,{"$f":"(SUM($AR$5:AR8)*12)*(1/((1+Ruhestandsplanung!$E$22)^(A9-'Ruhestandsplanung Berechnung'!$A$5)))","v":-76630.657793402905}]
[72,{"$f":"B9*(1+Ruhestandsplanung!$E$21)","v":0},{"$f":"C9*(1+Ruhestandsplanung!$E$21)","v":0},{"$f":"D9*(1+Ruhestandsplanung!$G$11)","v":2050.5025062562486},2050.5025062562486,81.45212522661015,1969.0503810296384,{"$f":"H9*(1+Ruhestandsplanung!$G$12)","v":0},0,0,0,{"$f":"L9*(1+Ruhestandsplanung!$G$13)","v":0},0,0,0,{"$f":"P9*(1+Ruhestandsplanung!$G$14)","v":0},0,0,0,{"$f":"T9*(1+Ruhestandsplanung!$G$15)","v":0},0,0,0,{"$f":"X9*(1+Ruhestandsplanung!$G$16)","v":0},0,0,0,{"$f":"AB9*(1+Ruhestandsplanung!$G$19)","v":0},0,0,0,2050.5025062562486,2050.5025062562486,{"$f":"steuer(Variablen!$B$3,AG10*12)/12","v":81.45212522661015},1969.0503810296384,null,1969.0503810296384,0,0,{"$f":"(AL10-(AM10*12))*Ruhestandsplanung!$E$22","v":0},{"$f":"steuer(Variablen!$B$3,AG10*12+AN10)/12-AH10","v":0},0,1969.0503810296384,-1969.0503810296384,{"$f":"(SUM($AR$5:AR9)*12)*(1/((1+Ruhestandsplanung!$E$22)^(A10-'Ruhestandsplanung Berechnung'!$A$5)))","v":-91418.188486186584}]
[73,{"$f":"B10*(1+Ruhestandsplanung!$E$21)","v":0},{"$f":"C10*(1+Ruhestandsplanung!$E$21)","v":0},{"$f":"D10*(1+Ruhestandsplanung!$G$11)","v":2060.7550187875295},2060.7550187875295,83.484366528866829,1977.2706522586627,{"$f":"H10*(1+Ruhestandsplanung!$G$12)","v":0},0,0,0,{"$f":"L10*(1+Ruhestandsplanung!$G$13)","v":0},0,0,0,{"$f":"P10*(1+Ruhestandsplanung!$G$14)","v":0},0,0,0,{"$f":"T10*(1+Ruhestandsplanung!$G$15)","v":0},0,0,0,{"$f":"X10*(1+Ruhestandsplanung!$G$16)","v":0},0,0,0,{"$f":"AB10*(1+Ruhestandsplanung!$G$19)","v":0},0,0,0,2060.7550187875295,2060.7550187875295,{"$f":"steuer(Variablen!$B$3,AG11*12)/12","v":83.484366528866829},1977.2706522586627,null,1977.2706522586627,0,0,{"$f":"(AL11-(AM11*12))*Ruhestandsplanung!$E$22","v":0},{"$f":"steuer(Variablen!$B$3,AG11*12+AN11)/12-AH11","v":0},0,1977.2706522586627,-1977.2706522586627,{"$f":"(SUM($AR$5:AR10)*12)*(1/((1+Ruhestandsplanung!$E$22)^(A11-'Ruhestandsplanung Berechnung'!$A$5)))","v":-104696.9699483462}]
[74,{"$f":"B11*(1+Ruhestandsplanung!$E$21)","v":0},{"$f":"C11*(1+Ruhestandsplanung!$E$21)","v":0},{"$f":"D11*(1+Ruhestandsplanung!$G$11)","v":2071.058793881467},2071.058793881467,85.539496217665373,1985.5192976638016,{"$f":"H11*(1+Ruhestandsplanung!$G$12)","v":0},0,0,0,{"$f":"L11*(1+Ruhestandsplanung!$G$13)","v":0},0,0,0,{"$f":"P11*(1+Ruhestandsplanung!$G$14)","v":0},0,0,0,{"$f":"T11*(1+Ruhestandsplanung!$G$15)","v":0},0,0,0,{"$f":"X11*(1+Ruhestandsplanung!$G$16)","v":0},0,0,0,{"$f":"AB11*(1+Ruhestandsplanung!$G$19)","v":0},0,0,0,2071.058793881467,2071.058793881467,{"$f":"steuer(Variablen!$B$3,AG12*12)/12","v":85.539496217665373},1985.5192976638016,null,1985.5192976638016,0,0,{"$f":"(AL12-(AM12*12))*Ruhestandsplanung!$E$22","v":0},{"$f":"steuer(Variablen!$B$3,AG12*12+AN12)/12-AH12","v":0},0,1985.5192976638016,-1985.5192976638016,{"$f":"(SUM($AR$5:AR11)*12)*(1/((1+Ruhestandsplanung!$E$22)^(A12-'Ruhestandsplanung Berechnung'!$A$5)))","v":-116573.91199689919}]
[75,{"$f":"B12*(1+Ruhestandsplanung!$E$21)","v":0},{"$f":"C12*(1+Ruhestandsplanung!$E$21)","v":0},{"$f":"D12*(1+Ruhestandsplanung!$G$11)","v":2081.4140878508742},2081.4140878508742,87.61770501704062,1993.7963828338336,{"$f":"H12*(1+Ruhestandsplanung!$G$12)","v":0},0,0,0,{"$f":"L12*(1+Ruhestandsplanung!$G$13)","v":0},0,0,0,{"$f":"P12*(1+Ruhestandsplanung!$G$14)","v":0},0,0,0,{"$f":"T12*(1+Ruhestandsplanung!$G$15)","v":0},0,0,0,{"$f":"X12*(1+Ruhestandsplanung!$G$16)","v":0},0,0,0,{"$f":"AB12*(1+Ruhestandsplanung!$G$19)","v":0},0,0,0,2081.4140878508742,2081.4140878508742,{"$f":"steuer(Variablen!$B$3,AG13*12)/12","v":87.61770501704062},1993.7963828338336,null,1993.7963828338336,0,0,{"$f":"(AL13-(AM13*12))*Ruhestandsplanung!$E$22","v":0},{"$f":"steuer(Variablen!$B$3,AG13*12+AN13)/12-AH13","v":0},0,1993.7963828338336,-1993.7963828338336,{"$f":"(SUM($AR$5:AR12)*12)*(1/((1+Ruhestandsplanung!$E$22)^(A13-'Ruhestandsplanung Berechnung'!$A$5)))","v":-127149.30470709717}]
[76,{"$f":"B13*(1+Ruhestandsplanung!$E$21)","v":0},{"$f":"C13*(1+Ruhestandsplanung!$E$21)","v":0},{"$f":"D13*(1+Ruhestandsplanung!$G$11)","v":2091.8211582901286},2091.8211582901286,89.719522203103907,2002.1016360870246,{"$f":"H13*(1+Ruhestandsplanung!$G$12)","v":0},0,0,0,{"$f":"L13*(1+Ruhestandsplanung!$G$13)","v":0},0,0,0,{"$f":"P13*(1+Ruhestandsplanung!$G$14)","v":0},0,0,0,{"$f":"T13*(1+Ruhestandsplanung!$G$15)","v":0},0,0,0,{"$f":"X13*(1+Ruhestandsplanung!$G$16)","v":0},0,0,0,{"$f":"AB13*(1+Ruhestandsplanung!$G$19)","v":0},0,0,{"$f":"AB14-AD14","v":0},2091.8211582901286,2091.8211582901286,{"$f":"steuer(Variablen!$B$3,AG14*12)/12","v":89.719522203103907},2002.1016360870246,null,2002.1016360870246,0,0,{"$f":"(AL14-(AM14*12))*Ruhestandsplanung!$E$22","v":0},{"$f":"steuer(Variablen!$B$3,AG14*12+AN14)/12-AH14","v":0},0,2002.1016360870246,-2002.1016360870246,{"$f":"(SUM($AR$5:AR13)*12)*(1/((1+Ruhestandsplanung!$E$22)^(A14-'Ruhestandsplanung Berechnung'!$A$5)))","v":-136517.20301749086}]
[77,{"$f":"B14*(1+Ruhestandsplanung!$E$21)","v":0},{"$f":"C14*(1+Ruhestandsplanung!$E$21)","v":0},{"$f":"D14*(1+Ruhestandsplanung!$G$11)","v":2102.2802640815789},2102.2802640815789,91.84446730297185,2010.435796778607,{"$f":"H14*(1+Ruhestandsplanung!$G$12)","v":0},0,0,0,{"$f":"L14*(1+Ruhestandsplanung!$G$13)","v":0},0,0,0,{"$f":"P14*(1+Ruhestandsplanung!$G$14)","v":0},0,0,0,{"$f":"T14*(1+Ruhestandsplanung!$G$15)","v":0},0,0,0,{"$f":"X14*(1+Ruhestandsplanung!$G$16)","v":0},0,0,{"$f":"X15-Z15","v":0},{"$f":"AB14*(1+Ruhestandsplanung!$G$19)","v":0},0,0,0,2102.2802640815789,2102.2802640815789,{"$f":"steuer(Variablen!$B$3,AG15*12)/12","v":91.84446730297185},2010.435796778607,null,2010.435796778607,0,0,{"$f":"(AL15-(AM15*12))*Ruhestandsplanung!$E$22","v":0},{"$f":"steuer(Variablen!$B$3,AG15*12+AN15)/12-AH15","v":0},0,2010.435796778607,-2010.435796778607,{"$f":"(SUM($AR$5:AR14)*12)*(1/((1+Ruhestandsplanung!$E$22)^(A15-'Ruhestandsplanung Berechnung'!$A$5)))","v":-144765.78457813532}]
[78,{"$f":"B15*(1+Ruhestandsplanung!$E$21)","v":0},{"$f":"C15*(1+Ruhestandsplanung!$E$21)","v":0},{"$f":"D15*(1+Ruhestandsplanung!$G$11)","v":2112.7916654019864},2112.7916654019864,93.993411203776063,2018.7982541982103,{"$f":"H15*(1+Ruhestandsplanung!$G$12)","v":0},0,0,0,{"$f":"L15*(1+Ruhestandsplanung!$G$13)","v":0},0,0,0,{"$f":"P15*(1+Ruhestandsplanung!$G$14)","v":0},0,0,0,{"$f":"T15*(1+Ruhestandsplanung!$G$15)","v":0},0,0,0,{"$f":"X15*(1+Ruhestandsplanung!$G$16)","v":0},0,0,0,{"$f":"AB15*(1+Ruhestandsplanung!$G$19)","v":0},0,0,0,2112.7916654019864,2112.7916654019864,{"$f":"steuer(Variablen!$B$3,AG16*12)/12","v":93.993411203776063},2018.7982541982103,null,2018.7982541982103,0,0,{"$f":"(AL16-(AM16*12))*Ruhestandsplanung!$E$22","v":0},{"$f":"steuer(Variablen!$B$3,AG16*12+AN16)/12-AH16","v":0},0,2018.7982541982103,-2018.7982541982103,{"$f":"(SUM($AR$5:AR15)*12)*(1/((1+Ruhestandsplanung!$E$22)^(A16-'Ruhestandsplanung Berechnung'!$A$5)))","v":-151977.69785767357}]
[79,{"$f":"B16*(1+Ruhestandsplanung!$E$21)","v":0},{"$f":"C16*(1+Ruhestandsplanung!$E$21)","v":0},{"$f":"D16*(1+Ruhestandsplanung!$G$11)","v":2123.3556237289963},2123.3556237289963,96.166210890310381,2027.1894128386859,{"$f":"H16*(1+Ruhestandsplanung!$G$12)","v":0},0,0,0,{"$f":"L16*(1+Ruhestandsplanung!$G$13)","v":0},0,0,0,{"$f":"P16*(1+Ruhestandsplanung!$G$14)","v":0},0,0,0,{"$f":"T16*(1+Ruhestandsplanung!$G$15)","v":0},0,0,0,{"$f":"X16*(1+Ruhestandsplanung!$G$16)","v":0},0,0,0,{"$f":"AB16*(1+Ruhestandsplanung!$G$19)","v":0},0,0,0,2123.3556237289963,2123.3556237289963,{"$f":"steuer(Variablen!$B$3,AG17*12)/12","v":96.166210890310381},2027.1894128386859,null,2027.1894128386859,0,0,{"$f":"(AL17-(AM17*12))*Ruhestandsplanung!$E$22","v":0},{"$f":"steuer(Variablen!$B$3,AG17*12+AN17)/12-AH17","v":0},0,2027.1894128386859,-2027.1894128386859,{"$f":"(SUM($AR$5:AR16)*12)*(1/((1+Ruhestandsplanung!$E$22)^(A17-'Ruhestandsplanung Berechnung'!$A$5)))","v":-158230.37351862493}]
[80,{"$f":"B17*(1+Ruhestandsplanung!$E$21)","v":0},{"$f":"C17*(1+Ruhestandsplanung!$E$21)","v":0},{"$f":"D17*(1+Ruhestandsplanung!$G$11)","v":2133.9724018476409},2133.9724018476409,98.363407884745257,2035.6089939628955,{"$f":"H17*(1+Ruhestandsplanung!$G$12)","v":0},{"$f":"H18*$E$1","v":0},0,{"$f":"H18-J18","v":0},{"$f":"L17*(1+Ruhestandsplanung!$G$13)","v":0},0,0,0,{"$f":"P17*(1+Ruhestandsplanung!$G$14)","v":0},0,0,0,{"$f":"T17*(1+Ruhestandsplanung!$G$15)","v":0},0,0,0,{"$f":"X17*(1+Ruhestandsplanung!$G$16)","v":0},0,0,0,{"$f":"AB17*(1+Ruhestandsplanung!$G$19)","v":0},0,0,0,2133.9724018476409,2133.9724018476409,{"$f":"steuer(Variablen!$B$3,AG18*12)/12","v":98.363407884745257},2035.6089939628955,null,2035.6089939628955,0,0,{"$f":"(AL18-(AM18*12))*Ruhestandsplanung!$E$22","v":0},{"$f":"steuer(Variablen!$B$3,AG18*12+AN18)/12-AH18","v":0},0,2035.6089939628955,-2035.6089939628955,{"$f":"(SUM($AR$5:AR17)*12)*(1/((1+Ruhestandsplanung!$E$22)^(A18-'Ruhestandsplanung Berechnung'!$A$5)))","v":-163596.33575642726}]
[81,{"$f":"B18*(1+Ruhestandsplanung!$E$21)","v":0},{"$f":"C18*(1+Ruhestandsplanung!$E$21)","v":0},{"$f":"D18*(1+Ruhestandsplanung!$G$11)","v":2144.6422638568788},2144.6422638568788,100.58520505068707,2044.0570588061917,{"$f":"H18*(1+Ruhestandsplanung!$G$12)","v":0},0,0,{"$f":"H19-J19","v":0},{"$f":"L18*(1+Ruhestandsplanung!$G$13)","v":0},0,0,0,{"$f":"P18*(1+Ruhestandsplanung!$G$14)","v":0},0,0,0,{"$f":"T18*(1+Ruhestandsplanung!$G$15)","v":0},0,0,0,{"$f":"X18*(1+Ruhestandsplanung!$G$16)","v":0},0,0,0,{"$f":"AB18*(1+Ruhestandsplanung!$G$19)","v":0},0,0,0,2144.6422638568788,2144.6422638568788,{"$f":"steuer(Variablen!$B$3,AG19*12)/12","v":100.58520505068707},2044.0570588061917,null,2044.0570588061917,{"$f":"IF(AP18<=0,0,AP18)","v":0},0,{"$f":"(AL19-(AM19*12))*Ruhestandsplanung!$E$22","v":0},{"$f":"steuer(Variablen!$B$3,AG19*12+AN19)/12-AH19","v":0},0,2044.0570588061917,-2044.0570588061917,{"$f":"(SUM($AR$5:AR18)*12)*(1/((1+Ruhestandsplanung!$E$22)^(A19-'Ruhestandsplanung Berechnung'!$A$5)))","v":-168143.48446590157}]
[82,{"$f":"B19*(1+Ruhestandsplanung!$E$21)","v":0},{"$f":"C19*(1+Ruhestandsplanung!$E$21)","v":0},{"$f":"D19*(1+Ruhestandsplanung!$G$11)","v":2155.3654751761628},2155.3654751761628,102.83180627083715,2052.5336689053256,{"$f":"H19*(1+Ruhestandsplanung!$G$12)","v":0},0,0,0,{"$f":"L19*(1+Ruhestandsplanung!$G$13)","v":0},0,0,0,{"$f":"P19*(1+Ruhestandsplanung!$G$14)","v":0},0,0,0,{"$f":"T19*(1+Ruhestandsplanung!$G$15)","v":0},0,0,0,{"$f":"X19*(1+Ruhestandsplanung!$G$16)","v":0},0,0,0,{"$f":"AB19*(1+Ruhestandsplanung!$G$19)","v":0},0,0,0,2155.3654751761628,2155.3654751761628,{"$f":"steuer(Variablen!$B$3,AG20*12)/12","v":102.83180627083715},2052.5336689053256,null,2052.5336689053256,0,0,{"$f":"(AL20-(AM20*12))*Ruhestandsplanung!$E$22","v":0},{"$f":"steuer(Variablen!$B$3,AG20*12+AN20)/12-AH20","v":0},0,2052.5336689053256,-2052.5336689053256,{"$f":"(SUM($AR$5:AR19)*12)*(1/((1+Ruhestandsplanung!$E$22)^(A20-'Ruhestandsplanung Berechnung'!$A$5)))","v":-171935.36860939901}]
[83,{"$f":"B20*(1+Ruhestandsplanung!$E$21)","v":0},{"$f":"C20*(1+Ruhestandsplanung!$E$21)","v":0},{"$f":"D20*(1+Ruhestandsplanung!$G$11)","v":2166.1423025520435},2166.1423025520435,105.10341644699206,2061.0388861050515,{"$f":"H20*(1+Ruhestandsplanung!$G$12)","v":0},0,0,0,{"$f":"L20*(1+Ruhestandsplanung!$G$13)","v":0},0,0,0,{"$f":"P20*(1+Ruhestandsplanung!$G$14)","v":0},0,0,0,{"$f":"T20*(1+Ruhestandsplanung!$G$15)","v":0},0,0,0,{"$f":"X20*(1+Ruhestandsplanung!$G$16)","v":0},0,0,0,{"$f":"AB20*(1+Ruhestandsplanung!$G$19)","v":0},0,0,0,2166.1423025520435,2166.1423025520435,{"$f":"steuer(Variablen!$B$3,AG21*12)/12","v":105.10341644699206},2061.0388861050515,null,2061.0388861050515,0,0,{"$f":"(AL21-(AM21*12))*Ruhestandsplanung!$E$22","v":0},{"$f":"steuer(Variablen!$B$3,AG21*12+AN21)/12-AH21","v":0},0,2061.0388861050515,-2061.0388861050515,{"$f":"(SUM($AR$5:AR20)*12)*(1/((1+Ruhestandsplanung!$E$22)^(A21-'Ruhestandsplanung Berechnung'!$A$5)))","v":-175031.44198019925}]
[84,{"$f":"B21*(1+Ruhestandsplanung!$E$21)","v":0},{"$f":"C21*(1+Ruhestandsplanung!$E$21)","v":0},{"$f":"D21*(1+Ruhestandsplanung!$G$11)","v":2176.9730140648035},2176.9730140648035,107.40059604448099,2069.5724180203224,{"$f":"H21*(1+Ruhestandsplanung!$G$12)","v":0},0,0,0,{"$f":"L21*(1+Ruhestandsplanung!$G$13)","v":0},0,0,0,{"$f":"P21*(1+Ruhestandsplanung!$G$14)","v":0},0,0,0,{"$f":"T21*(1+Ruhestandsplanung!$G$15)","v":0},0,0,0,{"$f":"X21*(1+Ruhestandsplanung!$G$16)","v":0},0,0,0,{"$f":"AB21*(1+Ruhestandsplanung!$G$19)","v":0},0,0,0,2176.9730140648035,2176.9730140648035,{"$f":"steuer(Variablen!$B$3,AG22*12)/12","v":107.40059604448099},2069.5724180203224,null,2069.5724180203224,0,0,{"$f":"(AL22-(AM22*12))*Ruhestandsplanung!$E$22","v":0},{"$f":"steuer(Variablen!$B$3,AG22*12+AN22)/12-AH22","v":0},0,2069.5724180203224,-2069.5724180203224,{"$f":"(SUM($AR$5:AR21)*12)*(1/((1+Ruhestandsplanung!$E$22)^(A22-'Ruhestandsplanung Berechnung'!$A$5)))","v":-177487.30467825118}]
[85,{"$f":"B22*(1+Ruhestandsplanung!$E$21)","v":0},{"$f":"C22*(1+Ruhestandsplanung!$E$21)","v":0},{"$f":"D22*(1+Ruhestandsplanung!$G$11)","v":2187.8578791351274},2187.8578791351274,109.72320179166536,2078.134677343462,{"$f":"H22*(1+Ruhestandsplanung!$G$12)","v":0},0,0,0,{"$f":"L22*(1+Ruhestandsplanung!$G$13)","v":0},0,0,0,{"$f":"P22*(1+Ruhestandsplanung!$G$14)","v":0},0,0,0,{"$f":"T22*(1+Ruhestandsplanung!$G$15)","v":0},0,0,0,{"$f":"X22*(1+Ruhestandsplanung!$G$16)","v":0},0,0,0,{"$f":"AB22*(1+Ruhestandsplanung!$G$19)","v":0},0,0,0,2187.8578791351274,2187.8578791351274,{"$f":"steuer(Variablen!$B$3,AG23*12)/12","v":109.72320179166536},2078.134677343462,null,2078.134677343462,0,0,{"$f":"(AL23-(AM23*12))*Ruhestandsplanung!$E$22","v":0},{"$f":"steuer(Variablen!$B$3,AG23*12+AN23)/12-AH23","v":0},0,2078.134677343462,-2078.134677343462,{"$f":"(SUM($AR$5:AR22)*12)*(1/((1+Ruhestandsplanung!$E$22)^(A23-'Ruhestandsplanung Berechnung'!$A$5)))","v":-179354.92930217896}]
[86,{"$f":"B23*(1+Ruhestandsplanung!$E$21)","v":0},{"$f":"C23*(1+Ruhestandsplanung!$E$21)","v":0},{"$f":"D23*(1+Ruhestandsplanung!$G$11)","v":2198.797168530803},2198.797168530803,112.07144167947364,2086.7257268513295,{"$f":"H23*(1+Ruhestandsplanung!$G$12)","v":0},0,0,0,{"$f":"L23*(1+Ruhestandsplanung!$G$13)","v":0},0,0,0,{"$f":"P23*(1+Ruhestandsplanung!$G$14)","v":0},0,0,0,{"$f":"T23*(1+Ruhestandsplanung!$G$15)","v":0},0,0,0,{"$f":"X23*(1+Ruhestandsplanung!$G$16)","v":0},0,0,0,{"$f":"AB23*(1+Ruhestandsplanung!$G$19)","v":0},0,0,0,2198.797168530803,2198.797168530803,{"$f":"steuer(Variablen!$B$3,AG24*12)/12","v":112.07144167947364},2086.7257268513295,null,2086.7257268513295,0,0,{"$f":"(AL24-(AM24*12))*Ruhestandsplanung!$E$22","v":0},{"$f":"steuer(Variablen!$B$3,AG24*12+AN24)/12-AH24","v":0},0,2086.7257268513295,-2086.7257268513295,{"$f":"(SUM($AR$5:AR23)*12)*(1/((1+Ruhestandsplanung!$E$22)^(A24-'Ruhestandsplanung Berechnung'!$A$5)))","v":-180682.87989197139}]
[87,{"$f":"B24*(1+Ruhestandsplanung!$E$21)","v":0},{"$f":"C24*(1+Ruhestandsplanung!$E$21)","v":0},{"$f":"D24*(1+Ruhestandsplanung!$G$11)","v":2209.7911543734567},2209.7911543734567,114.44624687092603,2095.3449075025305,{"$f":"H24*(1+Ruhestandsplanung!$G$12)","v":0},0,0,0,{"$f":"L24*(1+Ruhestandsplanung!$G$13)","v":0},0,0,0,{"$f":"P24*(1+Ruhestandsplanung!$G$14)","v":0},0,0,0,{"$f":"T24*(1+Ruhestandsplanung!$G$15)","v":0},0,0,0,{"$f":"X24*(1+Ruhestandsplanung!$G$16)","v":0},0,0,0,{"$f":"AB24*(1+Ruhestandsplanung!$G$19)","v":0},0,0,0,2209.7911543734567,2209.7911543734567,{"$f":"steuer(Variablen!$B$3,AG25*12)/12","v":114.44624687092603},2095.3449075025305,null,2095.3449075025305,0,0,{"$f":"(AL25-(AM25*12))*Ruhestandsplanung!$E$22","v":0},{"$f":"steuer(Variablen!$B$3,AG25*12+AN25)/12-AH25","v":0},0,2095.3449075025305,-2095.3449075025305,{"$f":"(SUM($AR$5:AR24)*12)*(1/((1+Ruhestandsplanung!$E$22)^(A25-'Ruhestandsplanung Berechnung'!$A$5)))","v":-181516.51299153836}]
[88,{"$f":"B25*(1+Ruhestandsplanung!$E$21)","v":0},{"$f":"C25*(1+Ruhestandsplanung!$E$21)","v":0},{"$f":"D25*(1+Ruhestandsplanung!$G$11)","v":2220.8401101453237},2220.8401101453237,116.8471140371466,2103.9929961081771,{"$f":"H25*(1+Ruhestandsplanung!$G$12)","v":0},0,0,0,{"$f":"L25*(1+Ruhestandsplanung!$G$13)","v":0},0,0,0,{"$f":"P25*(1+Ruhestandsplanung!$G$14)","v":0},0,0,0,{"$f":"T25*(1+Ruhestandsplanung!$G$15)","v":0},0,0,0,{"$f":"X25*(1+Ruhestandsplanung!$G$16)","v":0},0,0,0,{"$f":"AB25*(1+Ruhestandsplanung!$G$19)","v":0},0,0,0,2220.8401101453237,2220.8401101453237,{"$f":"steuer(Variablen!$B$3,AG26*12)/12","v":116.8471140371466},2103.9929961081771,null,2103.9929961081771,0,0,{"$f":"(AL26-(AM26*12))*Ruhestandsplanung!$E$22","v":0},{"$f":"steuer(Variablen!$B$3,AG26*12+AN26)/12-AH26","v":0},0,2103.9929961081771,-2103.9929961081771,{"$f":"(SUM($AR$5:AR25)*12)*(1/((1+Ruhestandsplanung!$E$22)^(A26-'Ruhestandsplanung Berechnung'!$A$5)))","v":-181898.16618579885}]
[89,{"$f":"B26*(1+Ruhestandsplanung!$E$21)","v":0},{"$f":"C26*(1+Ruhestandsplanung!$E$21)","v":0},{"$f":"D26*(1+Ruhestandsplanung!$G$11)","v":2231.9443106960503},2231.9443106960503,119.27498526192663,2112.6693254341235,{"$f":"H26*(1+Ruhestandsplanung!$G$12)","v":0},0,0,0,{"$f":"L26*(1+Ruhestandsplanung!$G$13)","v":0},0,0,0,{"$f":"P26*(1+Ruhestandsplanung!$G$14)","v":0},0,0,0,{"$f":"T26*(1+Ruhestandsplanung!$G$15)","v":0},0,0,0,{"$f":"X26*(1+Ruhestandsplanung!$G$16)","v":0},0,0,0,{"$f":"AB26*(1+Ruhestandsplanung!$G$19)","v":0},0,0,0,2231.9443106960503,2231.9443106960503,{"$f":"steuer(Variablen!$B$3,AG27*12)/12","v":119.27498526192663},2112.6693254341235,null,2112.6693254341235,0,0,{"$f":"(AL27-(AM27*12))*Ruhestandsplanung!$E$22","v":0},{"$f":"steuer(Variablen!$B$3,AG27*12+AN27)/12-AH27","v":0},0,2112.6693254341235,-2112.6693254341235,{"$f":"(SUM($AR$5:AR26)*12)*(1/((1+Ruhestandsplanung!$E$22)^(A27-'Ruhestandsplanung Berechnung'!$A$5)))","v":-181867.3455622207}]
[90,{"$f":"B27*(1+Ruhestandsplanung!$E$21)","v":0},{"$f":"C27*(1+Ruhestandsplanung!$E$21)","v":0},{"$f":"D27*(1+Ruhestandsplanung!$G$11)","v":2243.1040322495301},2243.1040322495301,121.72935058696459,2121.3746816625653,{"$f":"H27*(1+Ruhestandsplanung!$G$12)","v":0},0,0,0,{"$f":"L27*(1+Ruhestandsplanung!$G$13)","v":0},0,0,0,{"$f":"P27*(1+Ruhestandsplanung!$G$14)","v":0},0,0,0,{"$f":"T27*(1+Ruhestandsplanung!$G$15)","v":0},0,0,0,{"$f":"X27*(1+Ruhestandsplanung!$G$16)","v":0},0,0,0,{"$f":"AB27*(1+Ruhestandsplanung!$G$19)","v":0},0,0,0,2243.1040322495301,2243.1040322495301,{"$f":"steuer(Variablen!$B$3,AG28*12)/12","v":121.72935058696459},2121.3746816625653,null,2121.3746816625653,0,0,{"$f":"(AL28-(AM28*12))*Ruhestandsplanung!$E$22","v":0},{"$f":"steuer(Variablen!$B$3,AG28*12+AN28)/12-AH28","v":0},0,2121.3746816625653,-2121.3746816625653,{"$f":"(SUM($AR$5:AR27)*12)*(1/((1+Ruhestandsplanung!$E$22)^(A28-'Ruhestandsplanung Berechnung'!$A$5)))","v":-181460.88990552424}]
[{"$f":"A28+1","v":91},{"$f":"B28*(1+Ruhestandsplanung!$E$21)","v":0},{"$f":"C28*(1+Ruhestandsplanung!$E$21)","v":0},{"$f":"D28*(1+Ruhestandsplanung!$G$11)","v":2254.3195524107773},2254.3195524107773,124.21153304407424,2130.108019366703,{"$f":"H28*(1+Ruhestandsplanung!$G$12)","v":0},0,0,0,{"$f":"L28*(1+Ruhestandsplanung!$G$13)","v":0},0,0,0,{"$f":"P28*(1+Ruhestandsplanung!$G$14)","v":0},0,0,0,{"$f":"T28*(1+Ruhestandsplanung!$G$15)","v":0},0,0,0,{"$f":"X28*(1+Ruhestandsplanung!$G$16)","v":0},0,0,0,{"$f":"AB28*(1+Ruhestandsplanung!$G$19)","v":0},0,0,0,2254.3195524107773,2254.3195524107773,{"$f":"steuer(Variablen!$B$3,AG29*12)/12","v":124.21153304407424},2130.108019366703,null,2130.108019366703,0,0,{"$f":"(AL29-(AM29*12))*Ruhestandsplanung!$E$22","v":0},{"$f":"steuer(Variablen!$B$3,AG29*12+AN29)/12-AH29","v":0},0,2130.108019366703,-2130.108019366703,{"$f":"(SUM($AR$5:AR28)*12)*(1/((1+Ruhestandsplanung!$E$22)^(A29-'Ruhestandsplanung Berechnung'!$A$5)))","v":-180713.13772175397}]
[92,{"$f":"B29*(1+Ruhestandsplanung!$E$21)","v":0},{"$f":"C29*(1+Ruhestandsplanung!$E$21)","v":0},{"$f":"D29*(1+Ruhestandsplanung!$G$11)","v":2265.591150172831},2265.591150172831,126.72102268756002,2138.870127485271,{"$f":"H29*(1+Ruhestandsplanung!$G$12)","v":0},0,0,0,{"$f":"L29*(1+Ruhestandsplanung!$G$13)","v":0},0,0,0,{"$f":"P29*(1+Ruhestandsplanung!$G$14)","v":0},0,0,0,{"$f":"T29*(1+Ruhestandsplanung!$G$15)","v":0},0,0,0,{"$f":"X29*(1+Ruhestandsplanung!$G$16)","v":0},0,0,0,{"$f":"AB29*(1+Ruhestandsplanung!$G$19)","v":0},0,0,0,2265.591150172831,2265.591150172831,{"$f":"steuer(Variablen!$B$3,AG30*12)/12","v":126.72102268756002},2138.870127485271,null,2138.870127485271,0,0,{"$f":"(AL30-(AM30*12))*Ruhestandsplanung!$E$22","v":0},{"$f":"steuer(Variablen!$B$3,AG30*12+AN30)/12-AH30","v":0},0,2138.870127485271,-2138.870127485271,{"$f":"(SUM($AR$5:AR29)*12)*(1/((1+Ruhestandsplanung!$E$22)^(A30-'Ruhestandsplanung Berechnung'!$A$5)))","v":-179656.07183680963}]
[93,{"$f":"B30*(1+Ruhestandsplanung!$E$21)","v":0},{"$f":"C30*(1+Ruhestandsplanung!$E$21)","v":0},{"$f":"D30*(1+Ruhestandsplanung!$G$11)","v":2276.919105923695},2276.919105923695,129.25804162739453,2147.6610642963005,{"$f":"H30*(1+Ruhestandsplanung!$G$12)","v":0},0,0,0,{"$f":"L30*(1+Ruhestandsplanung!$G$13)","v":0},0,0,0,{"$f":"P30*(1+Ruhestandsplanung!$G$14)","v":0},0,0,0,{"$f":"T30*(1+Ruhestandsplanung!$G$15)","v":0},0,0,0,{"$f":"X30*(1+Ruhestandsplanung!$G$16)","v":0},0,0,0,{"$f":"AB30*(1+Ruhestandsplanung!$G$19)","v":0},0,0,0,2276.919105923695,2276.919105923695,{"$f":"steuer(Variablen!$B$3,AG31*12)/12","v":129.25804162739453},2147.6610642963005,null,2147.6610642963005,0,0,{"$f":"(AL31-(AM31*12))*Ruhestandsplanung!$E$22","v":0},{"$f":"steuer(Variablen!$B$3,AG31*12+AN31)/12-AH31","v":0},0,2147.6610642963005,-2147.6610642963005,{"$f":"(SUM($AR$5:AR30)*12)*(1/((1+Ruhestandsplanung!$E$22)^(A31-'Ruhestandsplanung Berechnung'!$A$5)))","v":-178319.46967636666}]
[94,{"$f":"B31*(1+Ruhestandsplanung!$E$21)","v":0},{"$f":"C31*(1+Ruhestandsplanung!$E$21)","v":0},{"$f":"D31*(1+Ruhestandsplanung!$G$11)","v":2288.3037014533134},2288.3037014533134,131.82356646456932,2156.4801349887439,{"$f":"H31*(1+Ruhestandsplanung!$G$12)","v":0},0,0,0,{"$f":"L31*(1+Ruhestandsplanung!$G$13)","v":0},0,0,0,{"$f":"P31*(1+Ruhestandsplanung!$G$14)","v":0},0,0,0,{"$f":"T31*(1+Ruhestandsplanung!$G$15)","v":0},0,0,0,{"$f":"X31*(1+Ruhestandsplanung!$G$16)","v":0},0,0,0,{"$f":"AB31*(1+Ruhestandsplanung!$G$19)","v":0},0,0,0,2288.3037014533134,2288.3037014533134,{"$f":"steuer(Variablen!$B$3,AG32*12)/12","v":131.82356646456932},2156.4801349887439,null,2156.4801349887439,0,0,{"$f":"(AL32-(AM32*12))*Ruhestandsplanung!$E$22","v":0},{"$f":"steuer(Variablen!$B$3,AG32*12+AN32)/12-AH32","v":0},0,2156.4801349887439,-2156.4801349887439,{"$f":"(SUM($AR$5:AR31)*12)*(1/((1+Ruhestandsplanung!$E$22)^(A32-'Ruhestandsplanung Berechnung'!$A$5)))","v":-176731.03522869269}]
[95,{"$f":"B32*(1+Ruhestandsplanung!$E$21)","v":0},{"$f":"C32*(1+Ruhestandsplanung!$E$21)","v":0},{"$f":"D32*(1+Ruhestandsplanung!$G$11)","v":2299.7452199605796},2299.7452199605796,134.41745615737977,2165.3277638031996,{"$f":"H32*(1+Ruhestandsplanung!$G$12)","v":0},0,0,0,{"$f":"L32*(1+Ruhestandsplanung!$G$13)","v":0},0,0,0,{"$f":"P32*(1+Ruhestandsplanung!$G$14)","v":0},0,0,0,{"$f":"T32*(1+Ruhestandsplanung!$G$15)","v":0},0,0,0,{"$f":"X32*(1+Ruhestandsplanung!$G$16)","v":0},0,0,0,{"$f":"AB32*(1+Ruhestandsplanung!$G$19)","v":0},0,0,0,2299.7452199605796,2299.7452199605796,{"$f":"steuer(Variablen!$B$3,AG33*12)/12","v":134.41745615737977},2165.3277638031996,null,2165.3277638031996,0,0,{"$f":"(AL33-(AM33*12))*Ruhestandsplanung!$E$22","v":0},{"$f":"steuer(Variablen!$B$3,AG33*12+AN33)/12-AH33","v":0},0,2165.3277638031996,-2165.3277638031996,{"$f":"(SUM($AR$5:AR32)*12)*(1/((1+Ruhestandsplanung!$E$22)^(A33-'Ruhestandsplanung Berechnung'!$A$5)))","v":-174916.52397910709}]
[96,{"$f":"B33*(1+Ruhestandsplanung!$E$21)","v":0},{"$f":"C33*(1+Ruhestandsplanung!$E$21)","v":0},{"$f":"D33*(1+Ruhestandsplanung!$G$11)","v":2311.2439460603823},2311.2439460603823,137.03994299779202,2174.2040030625903,{"$f":"H33*(1+Ruhestandsplanung!$G$12)","v":0},0,0,0,{"$f":"L33*(1+Ruhestandsplanung!$G$13)","v":0},0,0,0,{"$f":"P33*(1+Ruhestandsplanung!$G$14)","v":0},0,0,0,{"$f":"T33*(1+Ruhestandsplanung!$G$15)","v":0},0,0,0,{"$f":"X33*(1+Ruhestandsplanung!$G$16)","v":0},0,0,0,{"$f":"AB33*(1+Ruhestandsplanung!$G$19)","v":0},0,0,0,2311.2439460603823,2311.2439460603823,{"$f":"steuer(Variablen!$B$3,AG34*12)/12","v":137.03994299779202},2174.2040030625903,null,2174.2040030625903,0,0,{"$f":"(AL34-(AM34*12))*Ruhestandsplanung!$E$22","v":0},{"$f":"steuer(Variablen!$B$3,AG34*12+AN34)/12-AH34","v":0},0,2174.2040030625903,-2174.2040030625903,{"$f":"(SUM($AR$5:AR33)*12)*(1/((1+Ruhestandsplanung!$E$22)^(A34-'Ruhestandsplanung Berechnung'!$A$5)))","v":-172899.8666643929}]
[97,{"$f":"B34*(1+Ruhestandsplanung!$E$21)","v":0},{"$f":"C34*(1+Ruhestandsplanung!$E$21)","v":0},{"$f":"D34*(1+Ruhestandsplanung!$G$11)","v":2322.8001657906839},2322.8001657906839,139.69164399830399,2183.1085217923801,{"$f":"H34*(1+Ruhestandsplanung!$G$12)","v":0},0,0,{"$f":"H35-J35","v":0},{"$f":"L34*(1+Ruhestandsplanung!$G$13)","v":0},0,0,0,{"$f":"P34*(1+Ruhestandsplanung!$G$14)","v":0},0,0,0,{"$f":"T34*(1+Ruhestandsplanung!$G$15)","v":0},0,0,0,{"$f":"X34*(1+Ruhestandsplanung!$G$16)","v":0},0,0,0,{"$f":"AB34*(1+Ruhestandsplanung!$G$19)","v":0},0,0,0,2322.8001657906839,2322.8001657906839,{"$f":"steuer(Variablen!$B$3,AG35*12)/12","v":139.69164399830399},2183.1085217923801,null,2183.1085217923801,0,0,{"$f":"(AL35-(AM35*12))*Ruhestandsplanung!$E$22","v":0},{"$f":"steuer(Variablen!$B$3,AG35*12+AN35)/12-AH35","v":0},0,2183.1085217923801,-2183.1085217923801,{"$f":"(SUM($AR$5:AR34)*12)*(1/((1+Ruhestandsplanung!$E$22)^(A35-'Ruhestandsplanung Berechnung'!$A$5)))","v":-170703.28098140593}]
[98,{"$f":"B35*(1+Ruhestandsplanung!$E$21)","v":0},{"$f":"C35*(1+Ruhestandsplanung!$E$21)","v":0},{"$f":"D35*(1+Ruhestandsplanung!$G$11)","v":2334.4141666196369},2334.4141666196369,142.37241480448864,2192.0417518151485,{"$f":"H35*(1+Ruhestandsplanung!$G$12)","v":0},0,0,0,{"$f":"L35*(1+Ruhestandsplanung!$G$13)","v":0},0,0,0,{"$f":"P35*(1+Ruhestandsplanung!$G$14)","v":0},0,0,0,{"$f":"T35*(1+Ruhestandsplanung!$G$15)","v":0},0,0,0,{"$f":"X35*(1+Ruhestandsplanung!$G$16)","v":0},0,0,0,{"$f":"AB35*(1+Ruhestandsplanung!$G$19)","v":0},0,0,0,2334.4141666196369,2334.4141666196369,{"$f":"steuer(Variablen!$B$3,AG36*12)/12","v":142.37241480448864},2192.0417518151485,null,2192.0417518151485,0,0,{"$f":"(AL36-(AM36*12))*Ruhestandsplanung!$E$22","v":0},{"$f":"steuer(Variablen!$B$3,AG36*12+AN36)/12-AH36","v":0},0,2192.0417518151485,-2192.0417518151485,{"$f":"(SUM($AR$5:AR35)*12)*(1/((1+Ruhestandsplanung!$E$22)^(A36-'Ruhestandsplanung Berechnung'!$A$5)))","v":-168347.37708603815}]
[99,{"$f":"B36*(1+Ruhestandsplanung!$E$21)","v":0},{"$f":"C36*(1+Ruhestandsplanung!$E$21)","v":0},{"$f":"D36*(1+Ruhestandsplanung!$G$11)","v":2346.0862374527351},2346.0862374527351,145.08326760339332,2201.0029698493418,{"$f":"H36*(1+Ruhestandsplanung!$G$12)","v":0},0,0,0,{"$f":"L36*(1+Ruhestandsplanung!$G$13)","v":0},0,0,0,{"$f":"P36*(1+Ruhestandsplanung!$G$14)","v":0},0,0,0,{"$f":"T36*(1+Ruhestandsplanung!$G$15)","v":0},0,0,0,{"$f":"X36*(1+Ruhestandsplanung!$G$16)","v":0},0,0,0,{"$f":"AB36*(1+Ruhestandsplanung!$G$19)","v":0},0,0,0,2346.0862374527351,2346.0862374527351,{"$f":"steuer(Variablen!$B$3,AG37*12)/12","v":145.08326760339332},2201.0029698493418,null,2201.0029698493418,0,0,{"$f":"(AL37-(AM37*12))*Ruhestandsplanung!$E$22","v":0},{"$f":"steuer(Variablen!$B$3,AG37*12+AN37)/12-AH37","v":0},0,2201.0029698493418,-2201.0029698493418,{"$f":"(SUM($AR$5:AR36)*12)*(1/((1+Ruhestandsplanung!$E$22)^(A37-'Ruhestandsplanung Berechnung'!$A$5)))","v":-165851.260113311}]
[100,{"$f":"B37*(1+Ruhestandsplanung!$E$21)","v":0},{"$f":"C37*(1+Ruhestandsplanung!$E$21)","v":0},{"$f":"D37*(1+Ruhestandsplanung!$G$11)","v":2357.8166686399986},2357.8166686399986,147.82367225054017,2209.9929963894583,{"$f":"H37*(1+Ruhestandsplanung!$G$12)","v":0},0,0,0,{"$f":"L37*(1+Ruhestandsplanung!$G$13)","v":0},0,0,0,{"$f":"P37*(1+Ruhestandsplanung!$G$14)","v":0},0,0,0,{"$f":"T37*(1+Ruhestandsplanung!$G$15)","v":0},0,0,0,{"$f":"X37*(1+Ruhestandsplanung!$G$16)","v":0},0,0,0,{"$f":"AB37*(1+Ruhestandsplanung!$G$19)","v":0},0,0,0,{"$f":"D38+H38+L38+P38+T38+X38+AB38","v":2357.8166686399986},2357.8166686399986,{"$f":"steuer(Variablen!$B$3,AG38*12)/12","v":147.82367225054017},2209.9929963894583,null,2209.9929963894583,0,0,{"$f":"(AL38-(AM38*12))*Ruhestandsplanung!$E$22","v":0},{"$f":"steuer(Variablen!$B$3,AG38*12+AN38)/12-AH38","v":0},0,2209.9929963894583,-2209.9929963894583,{"$f":"(SUM($AR$5:AR37)*12)*(1/((1+Ruhestandsplanung!$E$22)^(A38-'Ruhestandsplanung Berechnung'!$A$5)))","v":-163232.62169933951}]
[101,{"$f":"B38*(1+Ruhestandsplanung!$E$21)","v":0},{"$f":"C38*(1+Ruhestandsplanung!$E$21)","v":0},{"$f":"D38*(1+Ruhestandsplanung!$G$11)","v":2369.6057519831984},2369.6057519831984,150.59425977795038,2219.011492205248,{"$f":"H38*(1+Ruhestandsplanung!$G$12)","v":0},0,0,0,{"$f":"L38*(1+Ruhestandsplanung!$G$13)","v":0},0,0,0,{"$f":"P38*(1+Ruhestandsplanung!$G$14)","v":0},0,0,0,{"$f":"T38*(1+Ruhestandsplanung!$G$15)","v":0},0,0,0,{"$f":"X38*(1+Ruhestandsplanung!$G$16)","v":0},0,0,0,{"$f":"AB38*(1+Ruhestandsplanung!$G$19)","v":0},0,0,0,2369.6057519831984,2369.6057519831984,{"$f":"steuer(Variablen!$B$3,AG39*12)/12","v":150.59425977795038},2219.011492205248,null,2219.011492205248,0,0,{"$f":"(AL39-(AM39*12))*Ruhestandsplanung!$E$22","v":0},{"$f":"steuer(Variablen!$B$3,AG39*12+AN39)/12-AH39","v":0},0,2219.011492205248,-2219.011492205248,{"$f":"(SUM($AR$5:AR38)*12)*(1/((1+Ruhestandsplanung!$E$22)^(A39-'Ruhestandsplanung Berechnung'!$A$5)))","v":-160507.83300153393}]
[102,{"$f":"B39*(1+Ruhestandsplanung!$E$21)","v":0},{"$f":"C39*(1+Ruhestandsplanung!$E$21)","v":0},{"$f":"D39*(1+Ruhestandsplanung!$G$11)","v":2381.4537807431143},2381.4537807431143,153.39567179938143,2228.0581089437328,{"$f":"H39*(1+Ruhestandsplanung!$G$12)","v":0},0,0,0,{"$f":"L39*(1+Ruhestandsplanung!$G$13)","v":0},0,0,0,{"$f":"P39*(1+Ruhestandsplanung!$G$14)","v":0},0,0,0,{"$f":"T39*(1+Ruhestandsplanung!$G$15)","v":0},0,0,0,{"$f":"X39*(1+Ruhestandsplanung!$G$16)","v":0},0,0,0,{"$f":"AB39*(1+Ruhestandsplanung!$G$19)","v":0},0,0,0,2381.4537807431143,2381.4537807431143,{"$f":"steuer(Variablen!$B$3,AG40*12)/12","v":153.39567179938143},2228.0581089437328,null,2228.0581089437328,0,0,{"$f":"(AL40-(AM40*12))*Ruhestandsplanung!$E$22","v":0},{"$f":"steuer(Variablen!$B$3,AG40*12+AN40)/12-AH40","v":0},0,2228.0581089437328,-2228.0581089437328,{"$f":"(SUM($AR$5:AR39)*12)*(1/((1+Ruhestandsplanung!$E$22)^(A40-'Ruhestandsplanung Berechnung'!$A$5)))","v":-157692.02557807416}]
[103,{"$f":"B40*(1+Ruhestandsplanung!$E$21)","v":0},{"$f":"C40*(1+Ruhestandsplanung!$E$21)","v":0},{"$f":"D40*(1+Ruhestandsplanung!$G$11)","v":2393.3610496468295},2393.3610496468295,156.22816301295734,2237.1328866338722,{"$f":"H40*(1+Ruhestandsplanung!$G$12)","v":0},0,0,0,{"$f":"L40*(1+Ruhestandsplanung!$G$13)","v":0},0,0,0,{"$f":"P40*(1+Ruhestandsplanung!$G$14)","v":0},0,0,0,{"$f":"T40*(1+Ruhestandsplanung!$G$15)","v":0},0,0,0,{"$f":"X40*(1+Ruhestandsplanung!$G$16)","v":0},0,0,0,{"$f":"AB40*(1+Ruhestandsplanung!$G$19)","v":0},0,0,0,2393.3610496468295,2393.3610496468295,{"$f":"steuer(Variablen!$B$3,AG41*12)/12","v":156.22816301295731},2237.1328866338722,null,2237.1328866338722,0,0,{"$f":"(AL41-(AM41*12))*Ruhestandsplanung!$E$22","v":0},{"$f":"steuer(Variablen!$B$3,AG41*12+AN41)/12-AH41","v":0},0,2237.1328866338722,-2237.1328866338722,{"$f":"(SUM($AR$5:AR40)*12)*(1/((1+Ruhestandsplanung!$E$22)^(A41-'Ruhestandsplanung Berechnung'!$A$5)))","v":-154799.17053552816}]
[104,{"$f":"B41*(1+Ruhestandsplanung!$E$21)","v":0},{"$f":"C41*(1+Ruhestandsplanung!$E$21)","v":0},{"$f":"D41*(1+Ruhestandsplanung!$G$11)","v":2405.3278548950634},2405.3278548950634,159.09158940958881,2246.2362654854746,{"$f":"H41*(1+Ruhestandsplanung!$G$12)","v":0},0,0,0,{"$f":"L41*(1+Ruhestandsplanung!$G$13)","v":0},0,0,0,{"$f":"P41*(1+Ruhestandsplanung!$G$14)","v":0},0,0,0,{"$f":"T41*(1+Ruhestandsplanung!$G$15)","v":0},0,0,0,{"$f":"X41*(1+Ruhestandsplanung!$G$16)","v":0},0,0,0,{"$f":"AB41*(1+Ruhestandsplanung!$G$19)","v":0},0,0,0,2405.3278548950634,2405.3278548950634,{"$f":"steuer(Variablen!$B$3,AG42*12)/12","v":159.09158940958881},2246.2362654854746,null,2246.2362654854746,0,0,{"$f":"(AL42-(AM42*12))*Ruhestandsplanung!$E$22","v":0},{"$f":"steuer(Variablen!$B$3,AG42*12+AN42)/12-AH42","v":0},0,2246.2362654854746,-2246.2362654854746,{"$f":"(SUM($AR$5:AR41)*12)*(1/((1+Ruhestandsplanung!$E$22)^(A42-'Ruhestandsplanung Berechnung'!$A$5)))","v":-151842.15380950423}]
[105,{"$f":"B42*(1+Ruhestandsplanung!$E$21)","v":0},{"$f":"C42*(1+Ruhestandsplanung!$E$21)","v":0},{"$f":"D42*(1+Ruhestandsplanung!$G$11)","v":2417.3544941695386},2417.3544941695386,161.98660347603436,2255.3678906935043,{"$f":"H42*(1+Ruhestandsplanung!$G$12)","v":0},0,0,0,{"$f":"L42*(1+Ruhestandsplanung!$G$13)","v":0},0,0,0,{"$f":"P42*(1+Ruhestandsplanung!$G$14)","v":0},0,0,0,{"$f":"T42*(1+Ruhestandsplanung!$G$15)","v":0},0,0,0,{"$f":"X42*(1+Ruhestandsplanung!$G$16)","v":0},0,0,0,{"$f":"AB42*(1+Ruhestandsplanung!$G$19)","v":0},0,0,0,2417.3544941695386,2417.3544941695386,{"$f":"steuer(Variablen!$B$3,AG43*12)/12","v":161.98660347603436},2255.3678906935043,null,2255.3678906935043,0,0,{"$f":"(AL43-(AM43*12))*Ruhestandsplanung!$E$22","v":0},{"$f":"steuer(Variablen!$B$3,AG43*12+AN43)/12-AH43","v":0},0,2255.3678906935043,-2255.3678906935043,{"$f":"(SUM($AR$5:AR42)*12)*(1/((1+Ruhestandsplanung!$E$22)^(A43-'Ruhestandsplanung Berechnung'!$A$5)))","v":-148832.84685234728}]
[106,{"$f":"B43*(1+Ruhestandsplanung!$E$21)","v":0},{"$f":"C43*(1+Ruhestandsplanung!$E$21)","v":0},{"$f":"D43*(1+Ruhestandsplanung!$G$11)","v":2429.4412666403859},2429.4412666403859,164.91346374396704,2264.527802896419,{"$f":"H43*(1+Ruhestandsplanung!$G$12)","v":0},0,0,0,{"$f":"L43*(1+Ruhestandsplanung!$G$13)","v":0},0,0,0,{"$f":"P43*(1+Ruhestandsplanung!$G$14)","v":0},0,0,0,{"$f":"T43*(1+Ruhestandsplanung!$G$15)","v":0},0,0,0,{"$f":"X43*(1+Ruhestandsplanung!$G$16)","v":0},0,0,0,{"$f":"AB43*(1+Ruhestandsplanung!$G$19)","v":0},0,0,0,2429.4412666403859,2429.4412666403859,{"$f":"steuer(Variablen!$B$3,AG44*12)/12","v":164.91346374396704},2264.527802896419,null,2264.527802896419,0,0,{"$f":"(AL44-(AM44*12))*Ruhestandsplanung!$E$22","v":0},{"$f":"steuer(Variablen!$B$3,AG44*12+AN44)/12-AH44","v":0},0,2264.527802896419,-2264.527802896419,{"$f":"(SUM($AR$5:AR43)*12)*(1/((1+Ruhestandsplanung!$E$22)^(A44-'Ruhestandsplanung Berechnung'!$A$5)))","v":-145782.17084379029}]
[107,{"$f":"B44*(1+Ruhestandsplanung!$E$21)","v":0},{"$f":"C44*(1+Ruhestandsplanung!$E$21)","v":0},{"$f":"D44*(1+Ruhestandsplanung!$G$11)","v":2441.5884729735876},2441.5884729735876,167.87243003485185,2273.7160429387359,{"$f":"H44*(1+Ruhestandsplanung!$G$12)","v":0},0,0,0,{"$f":"L44*(1+Ruhestandsplanung!$G$13)","v":0},0,0,0,{"$f":"P44*(1+Ruhestandsplanung!$G$14)","v":0},0,0,0,{"$f":"T44*(1+Ruhestandsplanung!$G$15)","v":0},0,0,0,{"$f":"X44*(1+Ruhestandsplanung!$G$16)","v":0},0,0,0,{"$f":"AB44*(1+Ruhestandsplanung!$G$19)","v":0},0,0,0,2441.5884729735876,2441.5884729735876,{"$f":"steuer(Variablen!$B$3,AG45*12)/12","v":167.87243003485185},2273.7160429387359,null,2273.7160429387359,0,0,{"$f":"(AL45-(AM45*12))*Ruhestandsplanung!$E$22","v":0},{"$f":"steuer(Variablen!$B$3,AG45*12+AN45)/12-AH45","v":0},0,2273.7160429387359,-2273.7160429387359,{"$f":"(SUM($AR$5:AR44)*12)*(1/((1+Ruhestandsplanung!$E$22)^(A45-'Ruhestandsplanung Berechnung'!$A$5)))","v":-142700.15947057621}]
[108,{"$f":"B45*(1+Ruhestandsplanung!$E$21)","v":0},{"$f":"C45*(1+Ruhestandsplanung!$E$21)","v":0},{"$f":"D45*(1+Ruhestandsplanung!$G$11)","v":2453.7964153384555},2453.7964153384555,170.86417310385366,2282.9322422346017,{"$f":"H45*(1+Ruhestandsplanung!$G$12)","v":0},0,0,0,{"$f":"L45*(1+Ruhestandsplanung!$G$13)","v":0},0,0,0,{"$f":"P45*(1+Ruhestandsplanung!$G$14)","v":0},0,0,0,{"$f":"T45*(1+Ruhestandsplanung!$G$15)","v":0},0,0,0,{"$f":"X45*(1+Ruhestandsplanung!$G$16)","v":0},0,0,0,{"$f":"AB45*(1+Ruhestandsplanung!$G$19)","v":0},0,0,0,2453.7964153384555,2453.7964153384555,{"$f":"steuer(Variablen!$B$3,AG46*12)/12","v":170.86417310385366},2282.9322422346017,null,2282.9322422346017,0,0,{"$f":"(AL46-(AM46*12))*Ruhestandsplanung!$E$22","v":0},{"$f":"steuer(Variablen!$B$3,AG46*12+AN46)/12-AH46","v":0},0,2282.9322422346017,-2282.9322422346017,{"$f":"(SUM($AR$5:AR45)*12)*(1/((1+Ruhestandsplanung!$E$22)^(A46-'Ruhestandsplanung Berechnung'!$A$5)))","v":-139596.01717208762}]
[109,{"$f":"B46*(1+Ruhestandsplanung!$E$21)","v":0},{"$f":"C46*(1+Ruhestandsplanung!$E$21)","v":0},{"$f":"D46*(1+Ruhestandsplanung!$G$11)","v":2466.0653974151473},2466.0653974151473,160.22741925109995,2305.8379781640474,{"$f":"H46*(1+Ruhestandsplanung!$G$12)","v":0},0,0,0,{"$f":"L46*(1+Ruhestandsplanung!$G$13)","v":0},0,0,0,{"$f":"P46*(1+Ruhestandsplanung!$G$14)","v":0},0,0,0,{"$f":"T46*(1+Ruhestandsplanung!$G$15)","v":0},0,0,0,{"$f":"X46*(1+Ruhestandsplanung!$G$16)","v":0},0,0,0,{"$f":"AB46*(1+Ruhestandsplanung!$G$19)","v":0},0,0,0,2466.0653974151473,2466.0653974151473,{"$f":"steuer(Variablen!$B$3,AG47*12)/12","v":160.22741925109995},2305.8379781640474,null,2305.8379781640474,0,0,{"$f":"(AL47-(AM47*12))*Ruhestandsplanung!$E$22","v":0},{"$f":"steuer(Variablen!$B$3,AG47*12+AN47)/12-AH47","v":0},0,2305.8379781640474,-2305.8379781640474,{"$f":"(SUM($AR$5:AR46)*12)*(1/((1+Ruhestandsplanung!$E$22)^(A47-'Ruhestandsplanung Berechnung'!$A$5)))","v":-136478.17328491085}]
[{"$f":"A47+1","v":110},{"$f":"B47*(1+Ruhestandsplanung!$E$21)","v":0},{"$f":"C47*(1+Ruhestandsplanung!$E$21)","v":0},{"$f":"D47*(1+Ruhestandsplanung!$G$11)","v":2478.3957244022226},2478.3957244022226,163.18706000972233,2315.2086643925004,{"$f":"H47*(1+Ruhestandsplanung!$G$12)","v":0},0,0,0,{"$f":"L47*(1+Ruhestandsplanung!$G$13)","v":0},0,0,0,{"$f":"P47*(1+Ruhestandsplanung!$G$14)","v":0},0,0,0,{"$f":"T47*(1+Ruhestandsplanung!$G$15)","v":0},0,0,0,{"$f":"X47*(1+Ruhestandsplanung!$G$16)","v":0},0,0,0,{"$f":"AB47*(1+Ruhestandsplanung!$G$19)","v":0},0,0,0,2478.3957244022226,2478.3957244022226,{"$f":"steuer(Variablen!$B$3,AG48*12)/12","v":163.18706000972233},2315.2086643925004,null,2315.2086643925004,0,0,{"$f":"(AL48-(AM48*12))*Ruhestandsplanung!$E$22","v":0},{"$f":"steuer(Variablen!$B$3,AG48*12+AN48)/12-AH48","v":0},0,2315.2086643925004,-2315.2086643925004,{"$f":"(SUM($AR$5:AR47)*12)*(1/((1+Ruhestandsplanung!$E$22)^(A48-'Ruhestandsplanung Berechnung'!$A$5)))","v":-133374.45026947471}]
[111,{"$f":"B48*(1+Ruhestandsplanung!$E$21)","v":0},{"$f":"C48*(1+Ruhestandsplanung!$E$21)","v":0},{"$f":"D48*(1+Ruhestandsplanung!$G$11)","v":2490.7877030242335},2490.7877030242335,166.1657425165823,2324.6219605076512,{"$f":"H48*(1+Ruhestandsplanung!$G$12)","v":0},0,0,0,{"$f":"L48*(1+Ruhestandsplanung!$G$13)","v":0},0,0,0,{"$f":"P48*(1+Ruhestandsplanung!$G$14)","v":0},0,0,0,{"$f":"T48*(1+Ruhestandsplanung!$G$15)","v":0},0,0,0,{"$f":"X48*(1+Ruhestandsplanung!$G$16)","v":0},0,0,0,{"$f":"AB48*(1+Ruhestandsplanung!$G$19)","v":0},0,0,0,2490.7877030242335,2490.7877030242335,{"$f":"steuer(Variablen!$B$3,AG49*12)/12","v":166.1657425165823},2324.6219605076512,null,2324.6219605076512,0,0,{"$f":"(AL49-(AM49*12))*Ruhestandsplanung!$E$22","v":0},{"$f":"steuer(Variablen!$B$3,AG49*12+AN49)/12-AH49","v":0},0,2324.6219605076512,-2324.6219605076512,{"$f":"(SUM($AR$5:AR48)*12)*(1/((1+Ruhestandsplanung!$E$22)^(A49-'Ruhestandsplanung Berechnung'!$A$5)))","v":-130269.9864570951}]
[112,{"$f":"B49*(1+Ruhestandsplanung!$E$21)","v":0},{"$f":"C49*(1+Ruhestandsplanung!$E$21)","v":0},{"$f":"D49*(1+Ruhestandsplanung!$G$11)","v":2503.2416415393545},2503.2416415393545,169.16272288271227,2334.0789186566421,{"$f":"H49*(1+Ruhestandsplanung!$G$12)","v":0},0,0,0,{"$f":"L49*(1+Ruhestandsplanung!$G$13)","v":0},0,0,0,{"$f":"P49*(1+Ruhestandsplanung!$G$14)","v":0},0,0,0,{"$f":"T49*(1+Ruhestandsplanung!$G$15)","v":0},0,0,0,{"$f":"X49*(1+Ruhestandsplanung!$G$16)","v":0},0,0,0,{"$f":"AB49*(1+Ruhestandsplanung!$G$19)","v":0},0,0,0,2503.2416415393545,2503.2416415393545,{"$f":"steuer(Variablen!$B$3,AG50*12)/12","v":169.1627228827123},2334.0789186566421,null,2334.0789186566421,0,0,{"$f":"(AL50-(AM50*12))*Ruhestandsplanung!$E$22","v":0},{"$f":"steuer(Variablen!$B$3,AG50*12+AN50)/12-AH50","v":0},0,2334.0789186566421,-2334.0789186566421,{"$f":"(SUM($AR$5:AR49)*12)*(1/((1+Ruhestandsplanung!$E$22)^(A50-'Ruhestandsplanung Berechnung'!$A$5)))","v":-127171.32147371332}]
[113,{"$f":"B50*(1+Ruhestandsplanung!$E$21)","v":0},{"$f":"C50*(1+Ruhestandsplanung!$E$21)","v":0},{"$f":"D50*(1+Ruhestandsplanung!$G$11)","v":2515.7578497470508},2515.7578497470508,172.17886198324931,2343.5789877638017,{"$f":"H50*(1+Ruhestandsplanung!$G$12)","v":0},0,0,0,{"$f":"L50*(1+Ruhestandsplanung!$G$13)","v":0},0,0,0,{"$f":"P50*(1+Ruhestandsplanung!$G$14)","v":0},0,0,0,{"$f":"T50*(1+Ruhestandsplanung!$G$15)","v":0},0,0,0,{"$f":"X50*(1+Ruhestandsplanung!$G$16)","v":0},0,0,0,{"$f":"AB50*(1+Ruhestandsplanung!$G$19)","v":0},0,0,0,2515.7578497470508,2515.7578497470508,{"$f":"steuer(Variablen!$B$3,AG51*12)/12","v":172.17886198324928},2343.5789877638017,null,2343.5789877638017,0,0,{"$f":"(AL51-(AM51*12))*Ruhestandsplanung!$E$22","v":0},{"$f":"steuer(Variablen!$B$3,AG51*12+AN51)/12-AH51","v":0},0,2343.5789877638017,-2343.5789877638017,{"$f":"(SUM($AR$5:AR50)*12)*(1/((1+Ruhestandsplanung!$E$22)^(A51-'Ruhestandsplanung Berechnung'!$A$5)))","v":-124084.39951989341}]
[114,{"$f":"B51*(1+Ruhestandsplanung!$E$21)","v":0},{"$f":"C51*(1+Ruhestandsplanung!$E$21)","v":0},{"$f":"D51*(1+Ruhestandsplanung!$G$11)","v":2528.336638995786},2528.336638995786,175.2138154234442,2353.122823572342,{"$f":"H51*(1+Ruhestandsplanung!$G$12)","v":0},0,0,0,{"$f":"L51*(1+Ruhestandsplanung!$G$13)","v":0},0,0,0,{"$f":"P51*(1+Ruhestandsplanung!$G$14)","v":0},0,0,0,{"$f":"T51*(1+Ruhestandsplanung!$G$15)","v":0},0,0,0,{"$f":"X51*(1+Ruhestandsplanung!$G$16)","v":0},0,0,0,{"$f":"AB51*(1+Ruhestandsplanung!$G$19)","v":0},0,0,0,2528.336638995786,2528.336638995786,{"$f":"steuer(Variablen!$B$3,AG52*12)/12","v":175.2138154234442},2353.122823572342,null,2353.122823572342,0,0,{"$f":"(AL52-(AM52*12))*Ruhestandsplanung!$E$22","v":0},{"$f":"steuer(Variablen!$B$3,AG52*12+AN52)/12-AH52","v":0},0,2353.122823572342,-2353.122823572342,{"$f":"(SUM($AR$5:AR51)*12)*(1/((1+Ruhestandsplanung!$E$22)^(A52-'Ruhestandsplanung Berechnung'!$A$5)))","v":-121014.60808378759}]
[115,{"$f":"B52*(1+Ruhestandsplanung!$E$21)","v":0},{"$f":"C52*(1+Ruhestandsplanung!$E$21)","v":0},{"$f":"D52*(1+Ruhestandsplanung!$G$11)","v":2540.9783221907646},2540.9783221907646,178.26804604783831,2362.7102761429264,{"$f":"H52*(1+Ruhestandsplanung!$G$12)","v":0},0,0,0,{"$f":"L52*(1+Ruhestandsplanung!$G$13)","v":0},0,0,0,{"$f":"P52*(1+Ruhestandsplanung!$G$14)","v":0},0,0,0,{"$f":"T52*(1+Ruhestandsplanung!$G$15)","v":0},0,0,0,{"$f":"X52*(1+Ruhestandsplanung!$G$16)","v":0},0,0,0,{"$f":"AB52*(1+Ruhestandsplanung!$G$19)","v":0},0,0,0,2540.9783221907646,2540.9783221907646,{"$f":"steuer(Variablen!$B$3,AG53*12)/12","v":178.26804604783834},2362.7102761429264,null,2362.7102761429264,0,0,{"$f":"(AL53-(AM53*12))*Ruhestandsplanung!$E$22","v":0},{"$f":"steuer(Variablen!$B$3,AG53*12+AN53)/12-AH53","v":0},0,2362.7102761429264,-2362.7102761429264,{"$f":"(SUM($AR$5:AR52)*12)*(1/((1+Ruhestandsplanung!$E$22)^(A53-'Ruhestandsplanung Berechnung'!$A$5)))","v":-117966.81799041103}]
[116,{"$f":"B53*(1+Ruhestandsplanung!$E$21)","v":0},{"$f":"C53*(1+Ruhestandsplanung!$E$21)","v":0},{"$f":"D53*(1+Ruhestandsplanung!$G$11)","v":2553.683213801718},2553.683213801718,181.34161405594048,2372.3415997457773,{"$f":"H53*(1+Ruhestandsplanung!$G$12)","v":0},0,0,0,{"$f":"L53*(1+Ruhestandsplanung!$G$13)","v":0},0,0,0,{"$f":"P53*(1+Ruhestandsplanung!$G$14)","v":0},0,0,0,{"$f":"T53*(1+Ruhestandsplanung!$G$15)","v":0},0,0,0,{"$f":"X53*(1+Ruhestandsplanung!$G$16)","v":0},0,0,0,{"$f":"AB53*(1+Ruhestandsplanung!$G$19)","v":0},0,0,0,2553.683213801718,2553.683213801718,{"$f":"steuer(Variablen!$B$3,AG54*12)/12","v":181.34161405594048},2372.3415997457773,null,2372.3415997457773,0,0,{"$f":"(AL54-(AM54*12))*Ruhestandsplanung!$E$22","v":0},{"$f":"steuer(Variablen!$B$3,AG54*12+AN54)/12-AH54","v":0},0,2372.3415997457773,-2372.3415997457773,{"$f":"(SUM($AR$5:AR53)*12)*(1/((1+Ruhestandsplanung!$E$22)^(A54-'Ruhestandsplanung Berechnung'!$A$5)))","v":-114945.41845418676}]
[117,{"$f":"B54*(1+Ruhestandsplanung!$E$21)","v":0},{"$f":"C54*(1+Ruhestandsplanung!$E$21)","v":0},{"$f":"D54*(1+Ruhestandsplanung!$G$11)","v":2566.4516298707263},2566.4516298707263,184.43457844386617,2382.0170514268602,{"$f":"H54*(1+Ruhestandsplanung!$G$12)","v":0},0,0,0,{"$f":"L54*(1+Ruhestandsplanung!$G$13)","v":0},0,0,0,{"$f":"P54*(1+Ruhestandsplanung!$G$14)","v":0},0,0,0,{"$f":"T54*(1+Ruhestandsplanung!$G$15)","v":0},0,0,0,{"$f":"X54*(1+Ruhestandsplanung!$G$16)","v":0},0,0,0,{"$f":"AB54*(1+Ruhestandsplanung!$G$19)","v":0},0,0,0,2566.4516298707263,2566.4516298707263,{"$f":"steuer(Variablen!$B$3,AG55*12)/12","v":184.43457844386617},2382.0170514268602,null,2382.0170514268602,0,0,{"$f":"(AL55-(AM55*12))*Ruhestandsplanung!$E$22","v":0},{"$f":"steuer(Variablen!$B$3,AG55*12+AN55)/12-AH55","v":0},0,2382.0170514268602,-2382.0170514268602,{"$f":"(SUM($AR$5:AR54)*12)*(1/((1+Ruhestandsplanung!$E$22)^(A55-'Ruhestandsplanung Berechnung'!$A$5)))","v":-111954.35144901888}]
[118,{"$f":"B55*(1+Ruhestandsplanung!$E$21)","v":0},{"$f":"C55*(1+Ruhestandsplanung!$E$21)","v":0},{"$f":"D55*(1+Ruhestandsplanung!$G$11)","v":2579.2838880200798},2579.2838880200798,187.54700000834657,2391.7368880117333,{"$f":"H55*(1+Ruhestandsplanung!$G$12)","v":0},0,0,0,{"$f":"L55*(1+Ruhestandsplanung!$G$13)","v":0},0,0,0,{"$f":"P55*(1+Ruhestandsplanung!$G$14)","v":0},0,0,0,{"$f":"T55*(1+Ruhestandsplanung!$G$15)","v":0},0,0,0,{"$f":"X55*(1+Ruhestandsplanung!$G$16)","v":0},0,0,0,{"$f":"AB55*(1+Ruhestandsplanung!$G$19)","v":0},0,0,0,2579.2838880200798,2579.2838880200798,{"$f":"steuer(Variablen!$B$3,AG56*12)/12","v":187.54700000834657},2391.7368880117333,null,2391.7368880117333,0,0,{"$f":"(AL56-(AM56*12))*Ruhestandsplanung!$E$22","v":0},{"$f":"steuer(Variablen!$B$3,AG56*12+AN56)/12-AH56","v":0},0,2391.7368880117333,-2391.7368880117333,{"$f":"(SUM($AR$5:AR55)*12)*(1/((1+Ruhestandsplanung!$E$22)^(A56-'Ruhestandsplanung Berechnung'!$A$5)))","v":-108997.14345159339}]
[119,{"$f":"B56*(1+Ruhestandsplanung!$E$21)","v":0},{"$f":"C56*(1+Ruhestandsplanung!$E$21)","v":0},{"$f":"D56*(1+Ruhestandsplanung!$G$11)","v":2592.1803074601798},2592.1803074601798,190.67934727841634,2401.5009601817637,{"$f":"H56*(1+Ruhestandsplanung!$G$12)","v":0},0,0,0,{"$f":"L56*(1+Ruhestandsplanung!$G$13)","v":0},0,0,0,{"$f":"P56*(1+Ruhestandsplanung!$G$14)","v":0},0,0,0,{"$f":"T56*(1+Ruhestandsplanung!$G$15)","v":0},0,0,0,{"$f":"X56*(1+Ruhestandsplanung!$G$16)","v":0},0,0,0,{"$f":"AB56*(1+Ruhestandsplanung!$G$19)","v":0},0,0,0,2592.1803074601798,2592.1803074601798,{"$f":"steuer(Variablen!$B$3,AG57*12)/12","v":190.67934727841634},2401.5009601817637,null,2401.5009601817637,0,0,{"$f":"(AL57-(AM57*12))*Ruhestandsplanung!$E$22","v":0},{"$f":"steuer(Variablen!$B$3,AG57*12+AN57)/12-AH57","v":0},0,2401.5009601817637,-2401.5009601817637,{"$f":"(SUM($AR$5:AR56)*12)*(1/((1+Ruhestandsplanung!$E$22)^(A57-'Ruhestandsplanung Berechnung'!$A$5)))","v":-106076.93521182443}]
[120,{"$f":"B57*(1+Ruhestandsplanung!$E$21)","v":0},{"$f":"C57*(1+Ruhestandsplanung!$E$21)","v":0},{"$f":"D57*(1+Ruhestandsplanung!$G$11)","v":2605.1412089974806},2605.1412089974806,193.83168026534395,2411.3095287321366,{"$f":"H57*(1+Ruhestandsplanung!$G$12)","v":0},0,0,0,{"$f":"L57*(1+Ruhestandsplanung!$G$13)","v":0},0,0,0,{"$f":"P57*(1+Ruhestandsplanung!$G$14)","v":0},0,0,0,{"$f":"T57*(1+Ruhestandsplanung!$G$15)","v":0},0,0,0,{"$f":"X57*(1+Ruhestandsplanung!$G$16)","v":0},0,0,0,{"$f":"AB57*(1+Ruhestandsplanung!$G$19)","v":0},0,0,0,2605.1412089974806,2605.1412089974806,{"$f":"steuer(Variablen!$B$3,AG58*12)/12","v":193.83168026534398},2411.3095287321366,null,2411.3095287321366,0,0,{"$f":"(AL58-(AM58*12))*Ruhestandsplanung!$E$22","v":0},{"$f":"steuer(Variablen!$B$3,AG58*12+AN58)/12-AH58","v":0},0,2411.3095287321366,-2411.3095287321366,{"$f":"(SUM($AR$5:AR57)*12)*(1/((1+Ruhestandsplanung!$E$22)^(A58-'Ruhestandsplanung Berechnung'!$A$5)))","v":-103196.50930111532}]
[121,{"$f":"B58*(1+Ruhestandsplanung!$E$21)","v":0},{"$f":"C58*(1+Ruhestandsplanung!$E$21)","v":0},{"$f":"D58*(1+Ruhestandsplanung!$G$11)","v":2618.1669150424677},2618.1669150424677,197.00365983756879,2421.1632552048991,{"$f":"H58*(1+Ruhestandsplanung!$G$12)","v":0},0,0,0,{"$f":"L58*(1+Ruhestandsplanung!$G$13)","v":0},0,0,0,{"$f":"P58*(1+Ruhestandsplanung!$G$14)","v":0},0,0,0,{"$f":"T58*(1+Ruhestandsplanung!$G$15)","v":0},0,0,0,{"$f":"X58*(1+Ruhestandsplanung!$G$16)","v":0},0,0,0,{"$f":"AB58*(1+Ruhestandsplanung!$G$19)","v":0},0,0,0,2618.1669150424677,2618.1669150424677,{"$f":"steuer(Variablen!$B$3,AG59*12)/12","v":197.00365983756879},2421.1632552048991,null,2421.1632552048991,0,0,{"$f":"(AL59-(AM59*12))*Ruhestandsplanung!$E$22","v":0},{"$f":"steuer(Variablen!$B$3,AG59*12+AN59)/12-AH59","v":0},0,2421.1632552048991,-2421.1632552048991,{"$f":"(SUM($AR$5:AR58)*12)*(1/((1+Ruhestandsplanung!$E$22)^(A59-'Ruhestandsplanung Berechnung'!$A$5)))","v":-100358.31672044231}]
[122,{"$f":"B59*(1+Ruhestandsplanung!$E$21)","v":0},{"$f":"C59*(1+Ruhestandsplanung!$E$21)","v":0},{"$f":"D59*(1+Ruhestandsplanung!$G$11)","v":2631.25774961768},2631.25774961768,200.19615708070955,2431.0615925369702,{"$f":"H59*(1+Ruhestandsplanung!$G$12)","v":0},0,0,0,{"$f":"L59*(1+Ruhestandsplanung!$G$13)","v":0},0,0,0,{"$f":"P59*(1+Ruhestandsplanung!$G$14)","v":0},0,0,0,{"$f":"T59*(1+Ruhestandsplanung!$G$15)","v":0},0,0,0,{"$f":"X59*(1+Ruhestandsplanung!$G$16)","v":0},0,0,0,{"$f":"AB59*(1+Ruhestandsplanung!$G$19)","v":0},0,0,0,2631.25774961768,2631.25774961768,{"$f":"steuer(Variablen!$B$3,AG60*12)/12","v":200.19615708070958},2431.0615925369702,null,2431.0615925369702,0,0,{"$f":"(AL60-(AM60*12))*Ruhestandsplanung!$E$22","v":0},{"$f":"steuer(Variablen!$B$3,AG60*12+AN60)/12-AH60","v":0},0,2431.0615925369702,-2431.0615925369702,{"$f":"(SUM($AR$5:AR59)*12)*(1/((1+Ruhestandsplanung!$E$22)^(A60-'Ruhestandsplanung Berechnung'!$A$5)))","v":-97564.501741148109}]
[123,{"$f":"B60*(1+Ruhestandsplanung!$E$21)","v":0},{"$f":"C60*(1+Ruhestandsplanung!$E$21)","v":0},{"$f":"D60*(1+Ruhestandsplanung!$G$11)","v":2644.4140383657682},2644.4140383657682,203.40842745881056,2441.0056109069578,{"$f":"H60*(1+Ruhestandsplanung!$G$12)","v":0},0,0,0,{"$f":"L60*(1+Ruhestandsplanung!$G$13)","v":0},0,0,0,{"$f":"P60*(1+Ruhestandsplanung!$G$14)","v":0},0,0,0,{"$f":"T60*(1+Ruhestandsplanung!$G$15)","v":0},0,0,0,{"$f":"X60*(1+Ruhestandsplanung!$G$16)","v":0},0,0,0,{"$f":"AB60*(1+Ruhestandsplanung!$G$19)","v":0},0,0,0,2644.4140383657682,2644.4140383657682,{"$f":"steuer(Variablen!$B$3,AG61*12)/12","v":203.40842745881056},2441.0056109069578,null,2441.0056109069578,0,0,{"$f":"(AL61-(AM61*12))*Ruhestandsplanung!$E$22","v":0},{"$f":"steuer(Variablen!$B$3,AG61*12+AN61)/12-AH61","v":0},0,2441.0056109069578,-2441.0056109069578,{"$f":"(SUM($AR$5:AR60)*12)*(1/((1+Ruhestandsplanung!$E$22)^(A61-'Ruhestandsplanung Berechnung'!$A$5)))","v":-94816.923845740981}]
[124,{"$f":"B61*(1+Ruhestandsplanung!$E$21)","v":0},{"$f":"C61*(1+Ruhestandsplanung!$E$21)","v":0},{"$f":"D61*(1+Ruhestandsplanung!$G$11)","v":2657.6361085575968},2657.6361085575968,206.64175201077555,2450.9943565468211,{"$f":"H61*(1+Ruhestandsplanung!$G$12)","v":0},0,0,0,{"$f":"L61*(1+Ruhestandsplanung!$G$13)","v":0},0,0,0,{"$f":"P61*(1+Ruhestandsplanung!$G$14)","v":0},0,0,0,{"$f":"T61*(1+Ruhestandsplanung!$G$15)","v":0},0,0,0,{"$f":"X61*(1+Ruhestandsplanung!$G$16)","v":0},0,0,0,{"$f":"AB61*(1+Ruhestandsplanung!$G$19)","v":0},0,0,0,2657.6361085575968,2657.6361085575968,{"$f":"steuer(Variablen!$B$3,AG62*12)/12","v":206.64175201077555},2450.9943565468211,null,2450.9943565468211,0,0,{"$f":"(AL62-(AM62*12))*Ruhestandsplanung!$E$22","v":0},{"$f":"steuer(Variablen!$B$3,AG62*12+AN62)/12-AH62","v":0},0,2450.9943565468211,-2450.9943565468211,{"$f":"(SUM($AR$5:AR61)*12)*(1/((1+Ruhestandsplanung!$E$22)^(A62-'Ruhestandsplanung Berechnung'!$A$5)))","v":-92117.180592158998}]
[]
[]
["Auswertung",null,null,null,null,null,null,null,null,null,null,"Auswertung Auszahlplan"]
[null,"Wunschrente","Gesamtrente","Lücke",null,null,null,null,null,null,null,null,"Wunschrente","Gesamtrente","Lücke"]
[{"$f":"A5","v":67},{"$f":"VLOOKUP(A67,$A$5:$AF$62,2)","v":0},{"$f":"VLOOKUP(A67,$A$5:$AF$62,11)","v":0},{"$f":"B67-C67","v":0},null,null,null,null,null,null,null,{"$f":"A67","v":67},{"$f":"VLOOKUP(L67,$A$5:$AF$62,2)","v":0},{"$f":"VLOOKUP(L67,$A$5:$AQ$62,18)","v":0},{"$f":"M67-N67","v":0}]
[{"$f":"A67+10","v":77},0,0,{"$f":"B68-C68","v":0},null,null,null,null,null,null,null,{"$f":"L67+10","v":77},0,0,0]
[{"$f":"A68+10","v":87},0,0,0,null,null,null,null,null,null,null,{"$f":"L68+10","v":87},0,0,0]
[97,0,0,0,null,null,null,null,null,null,null,97,0,0,0]
[107,0,0,0,null,null,null,null,null,null,null,107,0,0,0]
[{"$f":"A71+10","v":117},0,0,{"$f":"B72-C72","v":0},null,null,null,null,null,null,null,117,0,0,0]

{"sheet":"Risikoklasse","index":10,"n_rows":74,"n_cols":8,"rows_kept":74,"cut":false,"hidden":true,"merged":[[41,0,42,7],[26,5,26,6],[27,5,27,6],[19,0,19,4],[20,0,20,4],[21,0,21,4],[22,0,22,4],[23,0,23,4],[24,0,24,4],[22,5,22,6],[23,5,23,6],[24,5,24,6],[19,5,19,6],[20,5,20,6],[21,5,21,6],[27,0,27,4],[28,0,28,4],[28,5,28,6],[35,0,35,2],[31,0,31,4],[30,5,30,6],[31,5,31,6],[38,0,38,2],[30,0,30,4],[40,0,40,7],[29,0,29,4],[29,5,29,6],[51,0,51,7],[53,0,53,7],[54,0,54,7],[56,0,56,7],[57,0,57,7],[69,0,69,7],[72,0,72,7],[73,0,73,7],[71,6,71,7],[59,0,59,7],[60,0,60,7],[62,0,62,7],[63,0,63,7],[66,0,66,7]]}
[]
[]
[]
[]
[]
[]
[]
[]
[]
[]
[]
[]
[]
[]
[]
[]
[]
[]
[null,null,null,null,null,null,null,"   Risikostufe"]
["Gesetzliche Rente / Versorgungswerk",null,null,null,null,{"$f":"Eingabe!E16","v":2000}]
["Basisrente",null,null,null,null,{"$f":"Eingabe!E17","v":0}]
["Riesterrente",null,null,null,null,{"$f":"Eingabe!E18","v":0}]
["betriebliche Altersversorgung",null,null,null,null,{"$f":"Eingabe!E19","v":0}]
["Sonstige Renten",null,null,null,null,{"$f":"Eingabe!E21","v":0}]
["Immobilie",null,null,null,null,{"$f":"Eingabe!E21","v":0}]
[]
[]
["Sonstiges verfüg. Vermögen für die Altersversorgung",null,null,null,null,{"$f":"Eingabe!E24","v":0}]
["Verrentungsfaktor",null,null,null,null,{"$f":"'Risikoklasse Berechnen'!F1","v":335},null,{"$f":"'Risikoklasse Berechnen'!H12","v":1}]
["Rente aus dem Kapital",null,null,null,null,{"$f":"F28/F29","v":0}]
[]
["Neuanlage",null,null,null,null,0]
[]
[]
[]
["Ihre Ziel-Risikostufe"]
[null,null,null,{"$f":"IF('Risikoklasse Berechnen'!$C$1=1,0,1)","v":1},{"$f":"IF('Risikoklasse Berechnen'!$C$1=2,0,1)","v":1},{"$f":"IF('Risikoklasse Berechnen'!$C$1=3,0,1)","v":0},{"$f":"IF('Risikoklasse Berechnen'!$C$1=4,0,1)","v":1},{"$f":"IF('Risikoklasse Berechnen'!$C$1=5,0,1)","v":1}]
[null,null,null,{"$f":"IF('Risikoklasse Berechnen'!$J$21=1,0,1)","v":0},{"$f":"IF('Risikoklasse Berechnen'!$J$21=2,0,1)","v":1},{"$f":"IF('Risikoklasse Berechnen'!$J$21=3,0,1)","v":1},{"$f":"IF('Risikoklasse Berechnen'!$J$21=4,0,1)","v":1},{"$f":"IF('Risikoklasse Berechnen'!$J$21=5,0,1)","v":1}]
["Aktuelle Risikostufe Ihrer Gesamtanlage"]
[]
[{"$f":"\"Die Gesamtheit Ihres aktuellen Vermögens ist der Risikostufe \"&'Risikoklasse Berechnen'!J21&\" zugeordnet.\"","v":"Die Gesamtheit Ihres aktuellen Vermögens ist der Risikostufe 1 zugeordnet."}]
[{"$f":"IF('Risikoklasse Berechnen'!C1>'Risikoklasse Berechnen'!J21,\"Achtung, Ihre Gesamtanlage hat eine geringere Risikostufe als gewünscht. Dementsprechend kann die erwartete Rendite Ihrer aktuellen Vermögenstruktur niedriger ausfallen als erwartet!\",IF('Risikoklasse Berechnen'!C1<'Risikoklasse Berechnen'!J21,\"Achtung, Ihre Gesamtanlage hat eine größere Risikostufe als gewünscht.\",\"Ihre Risikostufe passt mit Ihrer Risikostufe der Gesamtanlage.\"))","v":"Achtung, Ihre Gesamtanlage hat eine geringere Risikostufe als gewünscht. Dementsprechend kann die erwartete Rendite Ihrer aktuellen Vermögenstruktur niedriger ausfallen als erwartet!"}]
[]
[]
[]
[]
[]
[]
[]
[]
[]
["Wichtige Fragen zu den einzelnen Anlagen"]
[]
["Gesetzliche Rente / Versorgungswerk"]
["Die gesetzliche Rente oder ein Versorgungswerk wird durch die Gesetzgebung und durch die Bevölkerungsstruktur beeinflusst. Wie wird sich dieser Einkommensbaustein entwickeln?"]
[]
["Betriebliche Altersversorgung"]
["Durch das Niedrigzinsumfeld werden die Überschüsse und Zinsen weiter sinken. Auch eine Reduktion der Anwartschaft durch den Arbeitgeber ist möglich. Wie wirkt sich das auf die Auszahlungen aus?"]
[]
["Immobilie"]
["Gibt es einen Instandhaltungsstau bei Ihrer Immobilie? Wie wird sich der Immobiliemarkt und auch der Standort Ihrer Immobilie entwickeln?"]
[]
["Lebensversicherungen / Rentenversicherungen"]
["Durch das Niedrigzinsumfeld werden die Überschüsse und Zinsen sinken. Welchen Einfluss hat dies auf die Ablaufwerte und Renten?"]
[]
["Fondspolicen / Investmentdepot"]
["Aktienmärkte können schwanken. Ist Ihr Depot so investiert, dass Sie vorübergehende Schwankungen abwarten und abfedern können?"]
[]
["Fazit"]
["Um ein angemessenes Einkommen im Alter zu gewährleisten, sollten Sie auf verschiedene Vorsorge-formen setzen. Zusätzlich sollten auch die Risikoklassen gemischt werden, um eine ausreichende Streuung der Risiken zu erreichen."]
[]
[null,null,null,null,null,null,{"$f":"\"Stand 1/\"&Variablen!B1&\"\"","v":"Stand 1/2022"}]
["Quelle: Eigene Berechnungen auf Basis Ihrer Angaben und der gesetzlichen / steuerrechtlichen  Daten."]
["Für die Richtigkeit der Angaben kann keine Gewähr übernommen werden, denn Programm- und Berechnungsfehler sind trotz sorgfältigstem Vorgehen nicht ausgeschlossen.                                                                          "]

{"sheet":"Risikoklasse Berechnen","index":11,"n_rows":24,"n_cols":10,"rows_kept":24,"cut":false,"hidden":true,"merged":[[23,0,23,10]]}
["Risikoklasse 1",2,{"$f":"IF(B1=5,1,B1+1)","v":3},null,"Rentenfaktor",{"$f":"Variablen!E13","v":335}]
["Risikoklasse2"]
["Risikoklasse 3"]
["Risikoklasse 4"]
["Risikoklasse 5"]
[]
[]
[]
[]
[]
[null,"Gesetzliche Rente","Basisrente","Riesterrente","bAV","Immobilie","Rente","Kapital","Neuanlage"]
[null,1,1,1,1,1,1,{"$f":"Variablen!B9","v":1},1]
[null,1,1,1,1,2,1,1,1]
[null,null,2,2,2,3,2,2,2]
[null,null,3,3,3,null,3,3,3]
[null,null,4,null,4,null,null,4,4]
[null,null,5,null,5,null,null,5,5]
["Rentenfaktor",{"$f":"Variablen!E11","v":335},{"$f":"Variablen!E11","v":335},{"$f":"Variablen!E11","v":335},{"$f":"Variablen!E11","v":335},null,{"$f":"Variablen!E13","v":335}]
["Kapital",{"$f":"Risikoklasse!F20*'Risikoklasse Berechnen'!B18","v":670000},{"$f":"Risikoklasse!F21*'Risikoklasse Berechnen'!C18","v":0},{"$f":"Risikoklasse!F22*'Risikoklasse Berechnen'!D18","v":0},{"$f":"Risikoklasse!F23*'Risikoklasse Berechnen'!E18","v":0},{"$f":"Risikoklasse!F25","v":0},{"$f":"Risikoklasse!F24*'Risikoklasse Berechnen'!G18","v":0},{"$f":"Risikoklasse!F28","v":0},{"$f":"Risikoklasse!F32","v":0},{"$f":"B19+C19+D19+E19+F19+G19+H19+I19","v":670000}]
["Prozent",{"$f":"B19/IF($J$19=0,0.0000001,$J$19)","v":1},{"$f":"C19/IF($J$19=0,0.0000001,$J$19)","v":0},0,0,0,0,0,0,{"$f":"SUM(B20:I20)","v":1}]
["Risikoklasse der Anlagen",{"$f":"B12*B20","v":1},{"$f":"C12*C20","v":0},0,0,0,0,0,0,{"$f":"ROUND(SUM(B21:I21),0)","v":1}]
[]
[]
["Achtung, Ihre Gesamtanlage hat eine geringere Risikoklasse als gewünscht. Dementsprechend kann die erwartete Rendite Ihrer aktuellen Vermögenstruktur niedriger ausfallen!"]

{"sheet":"Sicherheit Ausgabe","index":12,"n_rows":40,"n_cols":8,"rows_kept":40,"cut":false,"hidden":true,"merged":[[39,0,40,7],[11,0,11,7],[12,0,12,7],[27,0,27,7],[34,0,34,7],[35,0,35,7],[29,2,29,3],[30,2,30,3],[31,2,31,3],[29,4,29,5],[30,4,30,5],[31,4,31,5]]}
[]
[]
[]
[]
[]
[]
[]
[]
[]
[]
[]
["In der jetzigen Zinslandschaft sind hohe Renditen bei gleichzeitig hoher Sicherheit kaum noch möglich!"]
["Die Eigenschaften Rendite, Verfügbarkeit (Liquidität) und Sicherheit hängen \"magisch\" (magisches Drei-/Seckseck) miteinander zusammen. Oft kann nur ein Punkt optimiert werden. Dies bedeutet, wenn für ein Ziel (z.B. Ruhestand) eine gewisse Summe und somit eine gewisse Rendite benötigt wird, müssen bei den Punkten Sicherheit und / oder Verfügbarkeit Abstriche gemacht werden. Zusätzlich sollten Punkte wie Kosten, Steuer und Inflation berücksichtigt werden, da diese zusätzlich die Rendite beeinflussen."]
[]
[]
[]
[]
[]
[]
[]
[]
[]
[]
[]
[]
[]
[]
[{"$f":"\"Sie möchten Ihre Rentenlücke in Höhe von \"&FIXED(Eingabe!E31,0)&\" EUR mtl. mit Hilfe eines zusätzlichen Sparvertrags / Sparvolumens schließen.\"","v":"Sie möchten Ihre Rentenlücke in Höhe von 0 EUR mtl. mit Hilfe eines zusätzlichen Sparvertrags / Sparvolumens schließen."}]
[]
[null,null,"Rendite p.a.",null,"mtl. Beitrag"]
[null,null,{"$f":"Sicherheit!E15","v":0.02},null,{"$f":"ROUND(Sicherheit!G15,0)","v":0}]
[null,null,{"$f":"Sicherheit!G20","v":{"$error":"#NUM!"}},null,{"$f":"Sicherheit!E20","v":100}]
[]
[]
[{"$f":"\"Bei einer Rendite von \"&FIXED(Sicherheit!E15*100,2)&\"% p.a. ist eine monatliche Sparleistung von ca. \"&FIXED(Sicherheit!G15/10,0)*10&\" EUR monatlich erforderlich. Falls sich die Rendite in der Ansparphase auf \"&FIXED(Sicherheit!G20*100,2)&\"% p.a. belaufen wird, beträgt der notwendige Beitrag in der Ansparphase \"&FIXED(Sicherheit!E20,0)&\" EUR p.a..\"","v":{"$error":"#NUM!"}}]
[{"$f":"\"Was meinen Sie? Wäre etwas mehr Risiko - also auch etwas mehr Renditeerwartung - für Sie vorstellbar, um Ihr Ziel - das Schließen der Rentenlücke - zu erreichen? \nDiese \"&\"Angaben wurden mit einem durchschnittlichen Kostensatz berechnet. Renditen oberhalb von \"&Variablen!E24*100&\"% sprechen für Anlagen ohne Garantie.\"","v":"Was meinen Sie? Wäre etwas mehr Risiko - also auch etwas mehr Renditeerwartung - für Sie vorstellbar, um Ihr Ziel - das Schließen der Rentenlücke - zu erreichen? \nDiese Angaben wurden mit einem durchschnittlichen Kostensatz berechnet. Renditen oberhalb von 2% sprechen für Anlagen ohne Garantie."}]
[]
[]
["Quelle: Eigene Berechnungen auf Basis Ihrer Angaben und der gesetzlichen Daten.",null,null,null,null,null,null,{"$f":"\"1 / \"&Variablen!B1&\"\"","v":"1 / 2022"}]
["Für die Richtigkeit der Angaben kann keine Gewähr übernommen werden, denn Programm- und Berechnungsfehler sind trotz sorgfältigstem Vorgehen nicht ausgeschlossen.                                                                          "]

{"sheet":"Schichtennavigator Ausgabe","index":13,"n_rows":54,"n_cols":6,"rows_kept":54,"cut":false,"hidden":true,"merged":[[53,0,54,5],[12,4,12,6],[12,2,12,3],[27,1,27,5],[29,1,29,5],[31,0,31,6],[32,0,32,6],[16,5,17,5],[41,0,41,6],[42,0,42,6],[43,0,43,6]]}
[]
[]
[]
[]
[]
[]
[]
[]
[]
[]
[]
[]
[null,"Ziel:",{"$f":"Schichtennavigator!E13","v":0},null,{"$f":"\"im Alter von \"&Eingabe!C10&\" Jahren.\"","v":"im Alter von 67 Jahren."}]
[]
[]
[null,"Ansparphase","Basisrente","Riesterrente","Privatrente"]
[null,"Beitrag nach Förderung mtl.",{"$f":"'Schichtennavigator Berechnung'!E6","v":{"$error":"#NUM!"}},{"$f":"'Schichtennavigator Berechnung'!H10","v":{"$error":"#NUM!"}},{"$f":"E18","v":{"$error":"#NUM!"}},{"$f":"IF(Variablen!B9=1,\"\",\"ACHTUNG: Die Verrentung in der Privatrente ist als ''volatil'' vorgegeben! (\"&Variablen!B10&\")\")","v":""}]
[null,"Beitrag vor Förderung mtl.",{"$f":"-PMT((C19)/12,Variablen!B15*12,0,C20,1)","v":{"$error":"#NUM!"}},{"$f":"-PMT((D19)/12,Variablen!B15*12,0,D20,1)","v":{"$error":"#NUM!"}},{"$f":"-PMT((E19)/12,Variablen!B15*12,0,E20,1)","v":{"$error":"#NUM!"}}]
[null,"Zins p.a.",{"$f":"IF(Variablen!F16=2,MIN(MAX(Schichtennavigator!E17-Eingabe!E33,0)*IF(Variablen!F16=2,0.7,1),'Schichtennavigator Berechnung'!B2-Eingabe!E33),MAX(Schichtennavigator!E17-Eingabe!E33,0)*IF(Variablen!F16=2,0.7,1))","v":{"$error":"#NUM!"}},{"$f":"ROUNDUP(MIN(MAX(Schichtennavigator!E17-Eingabe!E33,0)*0.9*IF(Variablen!F16=2,0.7,1),('Schichtennavigator Berechnung'!B2-Eingabe!E33)*0.9*0.7),3)","v":{"$error":"#NUM!"}},{"$f":"IF(Variablen!F16=2,MIN(MAX(Schichtennavigator!E17-Eingabe!E33,0)*IF(Variablen!F16=2,0.7,1),'Schichtennavigator Berechnung'!B2-Eingabe!E33),MAX(Schichtennavigator!E17-Eingabe!E33,0)*IF(Variablen!F16=2,0.7,1))","v":{"$error":"#NUM!"}},{"$f":"\"Kosten Garantie: 30% (max. \"&Variablen!E24*100&\"% Rendite)\nMehrkosten Riester: 10%, Vertragskosten: \"&Eingabe!E33*100&\"% p.a.\"","v":"Kosten Garantie: 30% (max. 2% Rendite)\nMehrkosten Riester: 10%, Vertragskosten: 0,13% p.a."}]
[null,"Kapital",{"$f":"ROUND(C21*C24/1000,0)*1000","v":335000},{"$f":"ROUND(D21*D24/1000,0)*1000","v":335000},{"$f":"ROUND(E21*E24/1000,0)*1000","v":270000}]
[null,"Renten-Faktoren",{"$f":"Variablen!E11","v":335},{"$f":"C21","v":335},{"$f":"Variablen!E13","v":335}]
[]
[null,"Rentenphase","Basisrente","Riesterrente","Privatrente"]
[null,"Rente vor Steuern",{"$f":"MAX('Schichtennavigator Berechnung'!E16/12,0)","v":1000.0005932122821},{"$f":"MAX('Schichtennavigator Berechnung'!H16/12,0)","v":1000.00059321229},{"$f":"MAX('Schichtennavigator Berechnung'!B16/12,0)","v":807.15675165833545}]
[null,"Sonstige Renten",{"$f":"E25","v":2000},{"$f":"E25","v":2000},{"$f":"SUM(Eingabe!E16:F21)+Eingabe!E25","v":2000}]
[null,"Steuer (mtl.)",{"$f":"'Schichtennavigator Berechnung'!E35/12","v":291.88082816380614},{"$f":"'Schichtennavigator Berechnung'!H35/12","v":291.88082816380614},{"$f":"'Schichtennavigator Berechnung'!B35/12","v":99.037670361848143}]
[null,"Rente nach Steuern",{"$f":"C24+C25-C26","v":2708.119765048476},{"$f":"D24+D25-D26","v":2708.1197650484837},{"$f":"E24+E25-E26","v":2708.1190812964874}]
[null,{"$f":"\"Bitte beachten Sie, dass die simulierte Rechnung den maximalen Beitrag für die Riesterrente (2.100 EUR) und der Basisrente (\"&FIXED(Variablen!D29*Variablen!B3,0)&\" EUR) nicht berücksichtigt, damit die geförderten Produkte nicht wegen des Höchstbeitrages herausfallen.\"","v":"Bitte beachten Sie, dass die simulierte Rechnung den maximalen Beitrag für die Riesterrente (2.100 EUR) und der Basisrente (51.278 EUR) nicht berücksichtigt, damit die geförderten Produkte nicht wegen des Höchstbeitrages herausfallen."}]
[]
[null,"Die Berechnung zeigt folgende Reihenfolge, wenn es lediglich um die Eigenschaft \"Rendite\" geht. Bedenken Sie, dass geförderte Produkte eine gewisse Inflexibilität beinhalten. Lediglich in der Privatrente sind Sie voll flexibel! Eine Mischung aus geförderten und flexiblen Produkten (Privatrente) ist auf jeden Fall anzuraten."]
[]
["Rangfolge bei reiner Renditebetrachtung"]
[]
[null,null,null,{"$f":"\"\"&'Schichtennavigator Berechnung'!B9&\"\"","v":{"$error":"#NUM!"}}]
[]
[null,null,{"$f":"\"\"&'Schichtennavigator Berechnung'!B10&\"\"","v":{"$error":"#NUM!"}}]
[]
[null,null,null,null,{"$f":"\"\"&'Schichtennavigator Berechnung'!B11&\"\"","v":{"$error":"#NUM!"}}]
[]
[]
[]
[]
["Rangfolge bei Wunsch nach Flexibilitäten wie Entnahmen, fondsgebundene Verrentung  und freie Todesfallleistung"]
[]
[null,null,null,"Privatrente"]
[]
[null,null,"Riesterrente"]
[]
[null,null,null,null,"Basisrente"]
[]
[]
[]
["Quelle: Eigene Berechnungen auf Basis Ihrer Angaben und der gesetzlichen Daten.",null,null,null,{"$f":"\"1 / \"&Variablen!B1&\"\"","v":"1 / 2022"}]
["Für die Richtigkeit der Angaben kann keine Gewähr übernommen werden, denn Programm- und Berechnungsfehler sind trotz sorgfältigstem Vorgehen nicht ausgeschlossen.                                                                          "]

{"sheet":"Schichtennavigator Berechnung","index":14,"n_rows":36,"n_cols":8,"rows_kept":36,"cut":false,"hidden":true,"merged":[[12,0,12,1],[12,3,12,4],[12,6,12,7],[0,0,0,7],[7,0,7,1]]}
["Beitrags - Förderberchnung"]
["Maximale Rendite bei Beitragsgarantie:",{"$f":"Variablen!E24","v":0.02},null,"Brutto-Beitrag mtl.",{"$f":"'Schichtennavigator Ausgabe'!C18","v":{"$error":"#NUM!"}},null,"Brutto-Beitrag mtl. ",{"$f":"'Schichtennavigator Ausgabe'!D18","v":{"$error":"#NUM!"}}]
[{"$f":"MAX(A5,A6,A7)","v":{"$error":"#NUM!"}},"Maximum",null,"Prozent",{"$f":"Variablen!L2","v":0.94},null,"Prozent",1]
[{"$f":"MIN(A5,A6,A7)","v":{"$error":"#NUM!"}},"Minimum",null,"Absetzbar mtl.",{"$f":"E2*E3","v":{"$error":"#NUM!"}},null,"Absetzbar mtl.",{"$f":"H2*H3","v":{"$error":"#NUM!"}}]
[{"$f":"ROUND('Schichtennavigator Ausgabe'!C17,0)","v":{"$error":"#NUM!"}},"Basisrente",null,"Steuerersparnis p.a.",{"$f":"steuer(Variablen!B3,Hilfe!E17)-steuer(Variablen!B3,Hilfe!E17-'Schichtennavigator Berechnung'!E4*12)","v":{"$error":"#VALUE!"}},null,"Steuerersparnis p.a.",{"$f":"steuer(Variablen!B3,Hilfe!E17)-steuer(Variablen!B3,Hilfe!E17-H4*12)","v":{"$error":"#VALUE!"}}]
[{"$f":"ROUND('Schichtennavigator Ausgabe'!D17,0)","v":{"$error":"#NUM!"}},"Riesterrente",null,"Netto-Beitrag mtl.",{"$f":"E2-(E5/12)","v":{"$error":"#NUM!"}},null,"Zulage p.a.",{"$f":"Schichtennavigator!E15*Variablen!E20+Schichtennavigator!E16*Variablen!E21+Variablen!E22","v":175}]
[{"$f":"ROUND('Schichtennavigator Ausgabe'!E17,0)","v":{"$error":"#NUM!"}},"Privatrente"]
["Reihenfolge",null,null,null,null,null,"Günstigerprüfung",{"$f":"IF(H5>H6,H5,H6)","v":{"$error":"#VALUE!"}}]
["Platz 1",{"$f":"IF(A4=A5,B5,IF(A4=A6,B6,B7))","v":{"$error":"#NUM!"}}]
["Platz 2",{"$f":"IF(C10=A5,B5,IF(C10=A6,B6,B7))","v":{"$error":"#NUM!"}},{"$f":"SUM(A5:A7)-A3-A4","v":{"$error":"#NUM!"}},null,null,null,"Netto-Beitrag mtl.",{"$f":"MAX(H2-(H8/12),60/12)","v":{"$error":"#NUM!"}}]
["Platz 3",{"$f":"IF(A3=A5,B5,IF(A3=A6,B6,B7))","v":{"$error":"#NUM!"}}]
[]
["Private Rente",null,null,"Basisrente",null,null,"Riesterrente"]
["Gesamteinkommen",{"$f":"(SUM(Eingabe!E16:F21)+Eingabe!E25)*12","v":24000},null,"Gesamteinkommen",{"$f":"B14","v":24000},null,"Gesamteinkommen",{"$f":"E14","v":24000}]
["Sonstige Rente zu versteuern p.a.",{"$f":"Hilfe!B13","v":24000},null,"Sonstige Rente zu versteuern p.a.",{"$f":"B15","v":24000},null,"Sonstige Rente zu versteuern p.a.",{"$f":"E15","v":24000}]
["Brutto-Rente p.a.",9685.8810199000254,null,"Brutto-Basisrente p.a.",12000.007118547384,null,"Brutto-Basisrente p.a.",12000.007118547481]
["Steuer p.a.",{"$f":"steuer(Variablen!B3,'Schichtennavigator Berechnung'!B15+'Schichtennavigator Berechnung'!B16*Variablen!I2)","v":1188.4520443421777},null,"Steuer p.a.",{"$f":"steuer(Variablen!B3,'Schichtennavigator Berechnung'!E15+E16*Variablen!M3)","v":3502.5699379656735},null,"Steuer p.a.",{"$f":"steuer(Variablen!B3,'Schichtennavigator Berechnung'!H15+H16)","v":3502.5699379656735}]
["Netto Rente (Gesamt) mtl.",{"$f":"(B14+B16-B17)/12","v":2708.1190812964874},null,"Netto Rente (Gesamt) mtl.",{"$f":"(E14+E16-E17)/12","v":2708.119765048476},null,"Netto Rente (Gesamt) mtl.",{"$f":"(H14+H16-H17)/12","v":2708.1197650484842}]
["Netto Rentenziel (Gesamt, Vorgabe) mtl.",{"$f":"Schichtennavigator!G13","v":0},null,"Netto Rentenziel (Gesamt, Vorgabe) mtl.",{"$f":"B19","v":0},null,"Netto Rentenziel (Gesamt, Vorgabe) mtl.",{"$f":"E19","v":0}]
[]
[]
[]
[]
[]
["Einkommensart","Steuerpflichtig",null,"Einkommensart","Steuerpflichtig",null,"Einkommensart","Steuerpflichtig"]
[{"$f":"Hilfe!A6","v":"Gesetzliche Rente / Versorgungswerk (Brutto)"},{"$f":"Eingabe!E16*Variablen!M3","v":2000},null,{"$f":"A26","v":"Gesetzliche Rente / Versorgungswerk (Brutto)"},{"$f":"B26","v":2000},null,{"$f":"D26","v":"Gesetzliche Rente / Versorgungswerk (Brutto)"},{"$f":"E26","v":2000}]
[{"$f":"Hilfe!A7","v":"Basisrente (Brutto)"},{"$f":"Eingabe!E17*Variablen!M3","v":0},null,{"$f":"A27","v":"Basisrente (Brutto)"},{"$f":"B27","v":0},null,{"$f":"D27","v":"Basisrente (Brutto)"},{"$f":"E27","v":0}]
[{"$f":"Hilfe!A8","v":"Riesterrente (Brutto)"},{"$f":"Eingabe!E18","v":0},null,"Riesterrente (Brutto)",0,null,"Riesterrente (Brutto)",0]
[{"$f":"Hilfe!A9","v":"betriebliche Altersversorgung (Brutto)"},{"$f":"Eingabe!E19","v":0},null,"betriebliche Altersversorgung (Brutto)",0,null,"betriebliche Altersversorgung (Brutto)",0]
[{"$f":"Hilfe!A10","v":"Mieteinkünfte (Brutto)"},{"$f":"Eingabe!E20","v":0},null,"Mieteinkünfte (Brutto)",0,null,"Mieteinkünfte (Brutto)",0]
[{"$f":"Hilfe!A11","v":"Sonstige Renten m. Ertragsanteil (Brutto)"},{"$f":"Eingabe!E21*Variablen!I2","v":0},null,"Sonstige Renten m. Ertragsanteil (Brutto)",0,null,"Sonstige Renten m. Ertragsanteil (Brutto)",0]
[{"$f":"Hilfe!A12","v":"Sonstiges Vermögen (mit Ertragsanteil)"},{"$f":"Eingabe!E25*Variablen!I2","v":0},null,"Sonstiges Vermögen (mit Ertragsanteil)",0,null,"Sonstiges Vermögen (mit Ertragsanteil)",0]
["Private Rente mtl. (steuerpflichtig)",{"$f":"B16/12*Variablen!I2","v":137.21664778191703},null,"Basisrente mtl. (steuerpflichtig)",{"$f":"E16/12*Variablen!M3","v":1000.0005932122821},null,"Riesterrente mtl. (steuerpflichtig)",{"$f":"H16/12","v":1000.00059321229}]
[{"$f":"Hilfe!A13","v":"Gesamt Steuerpflichtig p.a."},{"$f":"SUM(B26:B33)*12","v":25646.599773383001},null,{"$f":"A34","v":"Gesamt Steuerpflichtig p.a."},{"$f":"SUM(E26:E33)*12","v":36000.007118547386},null,{"$f":"D34","v":"Gesamt Steuerpflichtig p.a."},{"$f":"SUM(H26:H33)*12","v":36000.007118547481}]
[{"$f":"Hilfe!A14","v":"Steuer"},{"$f":"steuer(Variablen!B3,'Schichtennavigator Berechnung'!B34)","v":1188.4520443421777},null,{"$f":"A35","v":"Steuer"},{"$f":"steuer(Variablen!B3,'Schichtennavigator Berechnung'!E34)","v":3502.5699379656735},null,{"$f":"D35","v":"Steuer"},{"$f":"steuer(Variablen!B3,'Schichtennavigator Berechnung'!H34)","v":3502.5699379656735}]
[{"$f":"Hilfe!A15","v":"Nettoeinkommen mtl."},{"$f":"(B14+B16-B35)/12","v":2708.1190812964874},null,{"$f":"A36","v":"Nettoeinkommen mtl."},{"$f":"(E14+E16-E35)/12","v":2708.119765048476},null,"Nettoeinkommen mtl.",{"$f":"(H14+H16-H35)/12","v":2708.1197650484842}]

{"sheet":"Ruhestandsplanung Ausgabe","index":15,"n_rows":102,"n_cols":8,"rows_kept":102,"cut":false,"hidden":true,"merged":[[83,0,83,7],[85,0,85,1],[26,0,26,7],[37,0,37,7],[11,0,11,7],[13,0,13,7],[14,0,14,7],[15,0,15,7],[25,0,25,7],[86,0,86,1],[87,0,87,1],[101,0,101,7],[89,0,89,7],[49,0,49,1],[50,0,50,1],[51,0,51,1],[55,0,55,7],[56,0,56,7],[57,0,57,7],[100,0,100,4],[58,0,58,5],[60,2,60,4],[62,2,62,4],[63,0,63,1],[66,0,66,7]]}
[]
[]
[]
[]
[]
[]
[]
[]
[]
[]
[]
[{"$f":"\"Ruhestandsplanung für \"&Eingabe!C8&\" \"&Eingabe!G8&\"\"","v":"Ruhestandsplanung für Max Mustermann"}]
[]
[{"$f":"\"Herzlichen Glückwunsch \"&Eingabe!C8&\" \"&Eingabe!G8&\", Sie haben es geschafft oder werden es bald erreicht haben. Ihre Rente oder besser gesagt Ihre ''365 Tage Urlaub'' beginnen demnächst!\"","v":"Herzlichen Glückwunsch Max Mustermann, Sie haben es geschafft oder werden es bald erreicht haben. Ihre Rente oder besser gesagt Ihre ''365 Tage Urlaub'' beginnen demnächst!"}]
["Früher war der Eintritt in den Ruhestand einfach und unkompliziert. Die gesetzliche Rente, die betriebliche Altersversorgung  und die Verrentung von angespartem Kapital reichten meist für einen sorgenfreien Ruhestand aus.\nDies hat sich nun grundlegend geändert. Zum Einen ist die prozentuale Höhe der gesetzlichen Rente deutlich gesunken, und zum anderen reichen die zusätzlichen Ersparnisse durch die Niedrigzinsphase oft nicht, um die Rentenlücke zu schließen."]
["Dass die Rentenanpassung in der GRV in der neueren Zeit mit der Inflation nicht mehr mithalten kann, ist an folgenden Grafiken gut zu erkennen:"]
[]
[]
[]
[]
[]
[]
[]
[]
[]
["Früher konnten Rentner mit einer steigenden Rente rechnen. Dies ist inzwischen nicht mehr der Fall. Die Rente schrumpft in der Regel nach Abzug der Inflation und Steuer."]
["Dieser Punkt - die dynamische Rentenlücke - sollte bei der Ruhestandsplanung unbedingt berücksichtigt werden."]
[]
[]
[]
[]
[]
[]
[]
[]
[]
[]
["Falls Sie Ihr liquides Vermögen verrenten, könnte Ihr Alterseinkommen ungefähr wie folgt aussehen:"]
[]
[]
[]
[]
[]
[]
[]
[]
[]
[]
[null,null,{"$f":"'Ruhestandsplanung Berechnung'!A67","v":67},{"$f":"'Ruhestandsplanung Berechnung'!A68","v":77},{"$f":"'Ruhestandsplanung Berechnung'!A69","v":87},{"$f":"'Ruhestandsplanung Berechnung'!A70","v":97},{"$f":"'Ruhestandsplanung Berechnung'!A71","v":107},{"$f":"'Ruhestandsplanung Berechnung'!A72","v":117}]
["Rentenwunsch",null,{"$f":"'Ruhestandsplanung Berechnung'!B67","v":0},{"$f":"'Ruhestandsplanung Berechnung'!B68","v":0},{"$f":"'Ruhestandsplanung Berechnung'!B69","v":0},{"$f":"'Ruhestandsplanung Berechnung'!B70","v":0},{"$f":"'Ruhestandsplanung Berechnung'!B71","v":0},{"$f":"'Ruhestandsplanung Berechnung'!B72","v":0}]
["Gesamtrenten",null,{"$f":"'Ruhestandsplanung Berechnung'!AI5","v":1928.3761957376},{"$f":"'Ruhestandsplanung Berechnung'!AI15","v":2010.435796778607},{"$f":"'Ruhestandsplanung Berechnung'!AI25","v":2095.3449075025305},{"$f":"'Ruhestandsplanung Berechnung'!AI35","v":2183.1085217923801},{"$f":"'Ruhestandsplanung Berechnung'!AI45","v":2273.7160429387359},{"$f":"'Ruhestandsplanung Berechnung'!AI55","v":2382.0170514268602}]
["Lücke",null,{"$f":"MAX(C50-C51,0)","v":0},{"$f":"MAX(D50-D51,0)","v":0},0,0,0,0]
[]
[]
[]
["Eine Verrentung geschieht immer in Form einer sicheren Anlage. In der Niedrigzinsphase ist jedoch die Renditeerwartung moderat. Auch die Rentensteigerung kann deswegen nur gering ausfallen.  Falls bei Ihnen eine Rentenlücke besteht oder Sie mit der zu erwartenden Rendite nicht zufrieden sind, könnten andere Gestaltungen interessant sein."]
["Bis zu Ihrem weit entfernten Lebensende ist noch genügend Zeit, um auch etwas risikoorientierter mit einer höheren Renditeerwartung zu investieren. Somit fließt Ihr angespartes Geld nicht automatisch in eine klassische Rente, sondern in eine Fondspolice mit Auszahlplan. Innerhalb der Fondspolice werden Investmentfonds als Anlage genutzt. "]
[{"$f":"\"Hätten Sie in der Vergangenheit z.B. nur in den deutschen Aktienindex DAX® investiert, hätten Sie eine Rendite von \"&FIXED(Variablen!Q54*100,2)&\"% p.a. über die Laufzeit von \"&Variablen!O54&\" Jahren erzielt. Betrachtet wurden alle möglichen \"&Variablen!O54&\"-Jahres Perioden im Zeitraum 30.10.1959 bis 30.12.2015.\"","v":"Hätten Sie in der Vergangenheit z.B. nur in den deutschen Aktienindex DAX® investiert, hätten Sie eine Rendite von 6,67% p.a. über die Laufzeit von 57 Jahren erzielt. Betrachtet wurden alle möglichen 57-Jahres Perioden im Zeitraum 30.10.1959 bis 30.12.2015."}]
["Hier eine Übersicht über die Daten aus der Vergangenheit:"]
[]
[]
[null,null,"Schlechteste","Mittlere","Beste","Anzahl der "]
[null,null,"Periode (Rendite p.a.)",null,null,"Perioden"]
[{"$f":"\"Laufzeit: \"&Variablen!B15&\" Jahre\"","v":"Laufzeit: 57 Jahre"},null,{"$f":"Variablen!P54","v":6.4159464189452675E-2},{"$f":"Variablen!Q54","v":6.6699765937169364E-2},{"$f":"Variablen!R54","v":6.7767909890470518E-2},{"$f":"Variablen!S54","v":62}]
[]
[]
[{"$f":"\"Falls Sie Ihr liquides Vermögen über einen Auszahlplan entnehmen, sieht ein möglicher Verlauf wie folgt aus (Renditeannahme: \"&Ruhestandsplanung!E22*100&\"% p.a.):\"","v":"Falls Sie Ihr liquides Vermögen über einen Auszahlplan entnehmen, sieht ein möglicher Verlauf wie folgt aus (Renditeannahme: 5% p.a.):"}]
[]
[]
[]
[]
[]
[]
[]
[]
[]
[]
[]
[]
[]
[]
[]
[]
[{"$f":"IF(Ruhestandsplanung!E18=0,\"ACHTUNG: Da Sie kein liquides Vermögen eingegeben haben, kann auch keine Alternative mit einem Auszahlplan angeboten werden!\",\"\")","v":"ACHTUNG: Da Sie kein liquides Vermögen eingegeben haben, kann auch keine Alternative mit einem Auszahlplan angeboten werden!"}]
[null,null,{"$f":"C49","v":67},{"$f":"D49","v":77},87,97,107,117]
["Rentenwunsch",null,{"$f":"C50","v":0},{"$f":"D50","v":0},0,0,0,0]
["Gesamtrenten",null,{"$f":"'Ruhestandsplanung Berechnung'!AQ5","v":1928.3761957376},{"$f":"'Ruhestandsplanung Berechnung'!AQ15","v":2010.435796778607},{"$f":"'Ruhestandsplanung Berechnung'!AQ25","v":2095.3449075025305},{"$f":"'Ruhestandsplanung Berechnung'!AQ35","v":2183.1085217923801},{"$f":"'Ruhestandsplanung Berechnung'!AQ45","v":2273.7160429387359},{"$f":"'Ruhestandsplanung Berechnung'!AQ55","v":2382.0170514268602}]
["Lücke",null,{"$f":"MAX(C86-C87,0)","v":0},{"$f":"MAX(D86-D87,0)","v":0},0,0,0,0]
[]
["Bei einem Auszahlplan gehen Sie immer das Risiko ein, dass das Kapital verbraucht wird. Aus diesem Grund können Sie vorhandene Kapital jederzeit verrenten, falls sich die Zinslandschaft wieder erholt hat. So kann der Auszahlplan zur Überbrückung der Niedrigzinsphase genutzt werden, um anschließend durch die Verrentung die potentielle Langlebigkeit abzusichern."]
[]
[]
[]
[]
[]
[]
[]
[]
[]
[]
["Quelle: Eigene Berechnungen auf Basis Ihrer Angaben und der gesetzlichen Daten.",null,null,null,null,null,null,{"$f":"\"1 / \"&Variablen!B1&\"\"","v":"1 / 2022"}]
["Für die Richtigkeit der Angaben kann keine Gewähr übernommen werden, denn Programm- und Berechnungsfehler sind trotz sorgfältigstem Vorgehen nicht ausgeschlossen.                                                                          "]