{"text_format":"1","workbook":"xlsx","n_sheets":5,"sheets":["Uebersicht","Hilfe","Berechnung niedrig Rückgang","Berechnung","Berechnung niedrig"],"not_rendered":{"charts":1,"images":1,"macros":1,"external_links":0,"defined_names":0,"comments":0,"pivot_tables":0},"unopened":[],"bounds":{"document_bytes":16777216,"sheet_cells":100000,"rows_first":2000,"rows_last":500,"rows_between":2000,"halvings":0,"cell_chars":16384,"cell_head_chars":4096},"cells_cut":0,"cells_raw":0,"read":"whole","date_system":"1900"}

{"sheet":"Uebersicht","index":0,"n_rows":67,"n_cols":7,"rows_kept":67,"cut":false,"hidden":false,"merged":[[64,0,64,5],[66,0,66,6],[34,0,34,4],[38,0,38,5],[50,0,50,5],[36,0,36,5],[37,0,37,5],[62,0,62,5],[32,0,32,4],[33,0,33,4],[23,4,23,5],[25,0,25,5],[29,0,29,5],[5,0,5,6],[7,0,7,6],[10,0,10,6],[11,0,11,6],[13,0,13,6],[9,0,9,6],[0,2,0,3],[1,2,1,3],[2,2,2,3],[3,2,3,3],[4,2,4,3],[20,0,20,3],[22,0,22,3],[15,0,15,3],[15,4,15,5],[18,0,18,6],[21,0,21,3],[20,4,20,5],[21,4,21,5],[22,4,22,5],[16,0,16,6]]}
[]
[]
[]
[]
[]
[{"$f":"IF(YEAR(TODAY())>Hilfe!E1,\"Version ist ungültig\",\"Zukunfts-Simulator\")","v":"Zukunfts-Simulator"}]
[]
["Wussten Sie, dass …"]
[]
["… der DAX® in den Jahren 2000 bis 2003 ca. 70% und in den darauffolgenden Jahren 2008 bis 2009 ca. 50% verloren hatte?"]
["… der DAX® nach sieben Jahren (2007) oder nach sechs Jahren (2013) die alten Höchststände wieder erreicht hatte? "]
["…, dass Sie ca. 7,7% p.a. erwirtschaftet hätten, wenn Sie am absoluten DAX®-Höchstand (2/2000) mit einem Sparvertrag begonnen und bis 2014 gespart hätten?"]
[]
["Aber wie geht es weiter?"]
[]
["Der heutige DAX® steht bei:",null,null,null,16000]
["Niemand kann in die Zukunft schauen. Daher wissen wir heute nicht, ob sich der Aktienindex aufwärts oder abwärts entwickelt. Aus diesem Grund werden verschiedene Kursverläufe per Zufall simuliert, um mögliche Auswirkungen deutlich zu machen. "]
[null,null,null,null,null,null,{"$f":"\"Beispiel- rendite zu Kursverlauf: \"&FIXED(Berechnung!O16*100,2)&\"%\"","v":"Beispiel- rendite zu Kursverlauf: 3,98%"}]
["Für die Simulationen schätzen Sie lediglich drei Dinge: \n\n1) Wie lange soll der Sparvertrag laufen?\n2) Wie tief wird der Kurs des DAX® Ihrer Meinung nach in der Laufzeit maximal fallen?\n3) Wie hoch wird der Kurs des DAX® am Ende des Sparvertrages sein? "]
[]
{"$rows_left_out":48}
{"sheet":"Hilfe","index":1,"n_rows":601,"n_cols":10,"rows_kept":601,"cut":false,"hidden":true,"merged":[[2,3,2,5],[10,3,10,5],[7,3,7,5],[8,3,8,5]]}
[{"$f":"Berechnung!A1","v":"Monate"},{"$f":"Berechnung!E1","v":"Kurs"},null,"Jahr",2022,null,null,"Zelle aus Monaten",null,{"$f":"Uebersicht!E21*12+1","v":361}]
[{"$f":"Berechnung!A2","v":1},{"$f":"Berechnung!E2","v":16062.222222222223},null,null,{"$f":"\"Stand 1/\"&E1&\"\"","v":"Stand 1/2022"}]
[{"$f":"Berechnung!A3","v":2},{"$f":"Berechnung!E3","v":15224.763254519114},null,"Monatsbeitrag",null,null,100]
[{"$f":"Berechnung!A4","v":3},{"$f":"Berechnung!E4","v":15758.199570923831},null,"Volatilität",7.0000000000000007E-2,-7.0000000000000007E-2]
[{"$f":"Berechnung!A5","v":4},{"$f":"Berechnung!E5","v":15012.076557809254}]
[{"$f":"Berechnung!A6","v":5},{"$f":"Berechnung!E6","v":15782.923960015421}]
[{"$f":"Berechnung!A7","v":6},{"$f":"Berechnung!E7","v":16038.231565474018}]
[{"$f":"Berechnung!A8","v":7},{"$f":"Berechnung!E8","v":15672.234663101226},null,{"$f":"\"Dax® in \"&FIXED(Uebersicht!E21,0)&\" Jahren\"","v":"Dax® in 30 Jahren"},null,null,11400,"Rendite"]
[{"$f":"Berechnung!A9","v":8},{"$f":"Berechnung!E9","v":16222.150349337046},null,{"$f":"'Berechnung niedrig Rückgang'!M8","v":16000},null,null,{"$f":"'Berechnung niedrig Rückgang'!O14","v":37244.893085993484},{"$f":"'Berechnung niedrig Rückgang'!O16","v":2.2601162406521691E-3}]
[{"$f":"Berechnung!A10","v":9},{"$f":"Berechnung!E10","v":15230.269365139275},null,null,{"$f":"Berechnung!M8","v":16000},null,{"$f":"Berechnung!O14","v":69124.857834758048},{"$f":"Berechnung!O16","v":3.9773044319072109E-2}]
[{"$f":"Berechnung!A11","v":10},{"$f":"Berechnung!E11","v":15366.608743748704},null,{"$f":"'Berechnung niedrig'!M8","v":12800},null,null,{"$f":"'Berechnung niedrig'!O14","v":45333.031161364212},{"$f":"'Berechnung niedrig'!O16","v":1.4867282999341123E-2}]
[{"$f":"Berechnung!A12","v":11},{"$f":"Berechnung!E12","v":15116.587311509706}]
[{"$f":"Berechnung!A13","v":12},{"$f":"Berechnung!E13","v":14891.886365426572}]
[{"$f":"Berechnung!A14","v":13},{"$f":"Berechnung!E14","v":14393.631381810754}]
[{"$f":"Berechnung!A15","v":14},{"$f":"Berechnung!E15","v":14236.447458268991}]
[{"$f":"Berechnung!A16","v":15},{"$f":"Berechnung!E16","v":10237.0005}]
[{"$f":"Berechnung!A17","v":16},{"$f":"Berechnung!E17","v":10357.300287342545}]
[{"$f":"Berechnung!A18","v":17},{"$f":"Berechnung!E18","v":10181.358165875941}]
[{"$f":"Berechnung!A19","v":18},{"$f":"Berechnung!E19","v":10529.864936658532}]
[{"$f":"Berechnung!A20","v":19},{"$f":"Berechnung!E20","v":10938.860363496802}]
{"$rows_left_out":582}
{"sheet":"Berechnung niedrig Rückgang","index":2,"n_rows":601,"n_cols":15,"rows_kept":601,"cut":false,"hidden":true,"merged":[[13,11,13,13],[14,11,14,13],[15,11,15,13]]}
["Monate","Verlust?","Volatilität","Verlust / Gewinn","Kurs","neue Anteile","Gesamtanteile","Anteilguthaben","Beitrag",null,null,"Verlust mtl.",{"$f":"(Uebersicht!E16-'Berechnung niedrig Rückgang'!M2)/(M5/2)","v":26.666666666666657}]
[1,{"$f":"IF(A2<M11*12/2+1,1,0)","v":1},{"$f":"RAND()*($N$6-$M$6)+$M$6","v":2.7316374330955136E-2},{"$f":"IF(B2=1,-$M$1,$M$4)","v":-26.666666666666657},{"$f":"MAX(M7-D2,M2)","v":16026.666666666666},{"$f":"$M$10/E2","v":6.2396006655574049E-3},{"$f":"F2","v":6.2396006655574049E-3},{"$f":"G2*E2","v":100},{"$f":"$M$10*A2","v":100},null,null,"Minimalwert",{"$f":"M7*(1-M9)","v":11200.000000000002}]
[2,{"$f":"IF(A3<$M$11*12/2+1,1,0)","v":1},{"$f":"RAND()*($N$6-$M$6)+$M$6","v":-4.8452296592555302E-2},{"$f":"IF(B3=1,-$M$1,$M$4)","v":-26.666666666666657},{"$f":"MAX(IF(A3=$M$5,$M$8,IF(A3=$M$5/2,$M$2,(E2+D3)*(1+C3))),$M$2)","v":15224.763254519114},{"$f":"$M$10/E3","v":6.5682466340038059E-3},{"$f":"G2+F3","v":1.280784729956121E-2},{"$f":"G3*E3","v":194.99644293585138},{"$f":"$M$10*A3","v":200},null,null,"max. Gewinn",{"$f":"M8-M2","v":4799.9999999999982}]
[3,{"$f":"IF(A4<$M$11*12/2+1,1,0)","v":1},{"$f":"RAND()*($N$6-$M$6)+$M$6","v":3.9284875625936203E-2},{"$f":"IF(B4=1,-$M$1,$M$4)","v":-26.666666666666657},{"$f":"MAX(IF(A4=$M$5,$M$8,IF(A4=$M$5/2,$M$2,(E3+D4)*(1+C4))),$M$2)","v":15795.151922057197},{"$f":"$M$10/E4","v":6.3310565478230463E-3},{"$f":"G3+F4","v":1.9138903847384255E-2},302.30189389107932,{"$f":"$M$10*A4","v":300},null,null,"Gewinn mtl.",{"$f":"M3/(M5/2)","v":26.666666666666657}]
[4,1,-4.3571723869041332E-2,-26.666666666666657,15081.425170009607,6.6306730877700136E-3,2.5769576935154269E-2,388.64194621033459,400,null,null,"Raten",{"$f":"Uebersicht!E21*12","v":360}]
[5,1,5.5724263643514391E-2,-26.666666666666657,15893.673835272664,6.2918115117016589E-3,3.206138844685593E-2,509.57325068030741,500,null,null,"Volatilität",{"$f":"Hilfe!E4","v":7.0000000000000007E-2},{"$f":"Hilfe!F4","v":-7.0000000000000007E-2}]
[6,1,2.0198196809336003E-2,-26.666666666666657,16187.49210217265,6.1776091916411324E-3,3.8238997638497065E-2,618.99347226816985,600,null,null,"Dax heute",{"$f":"Uebersicht!E16","v":16000}]
[7,1,-1.9014428047945772E-2,-26.666666666666657,15853.536583067144,6.3077408296902072E-3,4.4546738468187269E-2,706.22334796173129,700,null,null,"Dax Zukunft",{"$f":"Berechnung!M8","v":16000}]
[8,1,3.9214440781289606E-2,-26.666666666666657,16447.511769490338,6.0799470097049647E-3,5.062668547789223E-2,832.683005247918,800,null,null,"Rückgang",{"$f":"MAX(Uebersicht!E22-40%,0)","v":0.29999999999999993}]
[9,1,-5.752864459933274E-2,-26.666666666666657,15476.176140882635,6.4615444467470903E-3,5.7088229924639321E-2,883.50750188492509,900,null,null,"Beitrag",{"$f":"Hilfe!G3","v":100}]
[10,1,1.3090782152821549E-2,-26.666666666666657,15651.755637110882,6.3890596249085545E-3,6.3477289549547872E-2,993.53102453565555,1000,null,null,"Laufzeit",{"$f":"Uebersicht!E21","v":30}]
[11,1,-1.2270940083264709E-2,-26.666666666666657,15433.354439892215,6.4794727801701672E-3,6.9956762329718036E-2,1079.6675085018383,1100]
[12,1,-1.0792798161679329E-2,-26.666666666666657,15240.406501749112,6.5615047727580755E-3,7.6518267102476112E-2,1166.1694954511522,1200]
[13,1,-2.9402740155339641E-2,-26.666666666666657,14766.414195920577,6.7721248146775104E-3,8.3290391917153622E-2,1229.9004255892457,1300,null,null,{"$f":"\"Ablauf in \"&FIXED(Uebersicht!E21,0)&\" Jahren\"","v":"Ablauf in 30 Jahren"},null,null,{"$f":"VLOOKUP(M5,A:I,8)","v":37244.893085993484}]
[14,1,-6.6261244977439404E-3,-26.666666666666657,14642.080127059762,6.8296307035768649E-3,9.0120022620730489E-2,1319.5445922651741,1400,null,null,{"$f":"\"Beitragsumme über \"&FIXED(Uebersicht!E21,0)&\" Jahren\"","v":"Beitragsumme über 30 Jahren"},null,null,{"$f":"VLOOKUP(Uebersicht!E21*12,Berechnung!A1:I601,9)","v":36000}]
[15,1,3.0662416030842451E-2,-26.666666666666657,15063.557348378443,6.6385381412422326E-3,9.6758560761972728E-2,1457.5281289845364,1500,null,null,"Rendite p.a.",null,null,{"$f":"RATE(M5,-M10,0,O14,0,1%)*12","v":2.2601162406521691E-3}]
[16,1,1.7938671937786151E-2,-26.666666666666657,15306.632530615358,6.5331156150764272E-3,0.10329167637704915,1581.0477337747345,1600]
[17,1,-1.1046045355368642E-2,-26.666666666666657,15111.182667987028,6.6176157218885024E-3,0.10990929209893766,1660.8593898161903,1700]
[18,1,4.0589334434468716E-2,-26.666666666666657,15696.78646608005,6.3707307362621561E-3,0.11628002283519981,1825.2226887150434,1800]
[19,1,4.501659656482359E-2,-26.666666666666657,16375.535260546028,6.1066706161924614E-3,0.12238669345139228,2004.1476140349118,1900]
{"$rows_left_out":582}
{"sheet":"Berechnung","index":3,"n_rows":601,"n_cols":15,"rows_kept":601,"cut":false,"hidden":true,"merged":[[13,11,13,13],[14,11,14,13],[15,11,15,13]]}
["Monate","Verlust?","Volatilität","Verlust / Gewinn","Kurs","neue Anteile","Gesamtanteile","Anteilguthaben","Beitrag",null,null,"Verlust mtl.",{"$f":"(Uebersicht!E16-Berechnung!M2)/(M5/2)","v":62.222222222222221}]
[1,{"$f":"IF(A2<M11*12/2+1,1,0)","v":1},{"$f":"'Berechnung niedrig Rückgang'!C2","v":2.7316374330955136E-2},{"$f":"IF(B2=1,-$M$1,$M$4)","v":-62.222222222222221},{"$f":"MAX(M7-D2,M2)","v":16062.222222222223},{"$f":"$M$10/E2","v":6.2257885998893191E-3},{"$f":"F2","v":6.2257885998893191E-3},{"$f":"G2*E2","v":100},{"$f":"$M$10*A2","v":100},null,null,"Minimalwert",{"$f":"M7*(1-M9)","v":4800.0000000000009}]
[2,{"$f":"IF(A3<$M$11*12/2+1,1,0)","v":1},{"$f":"'Berechnung niedrig Rückgang'!C3","v":-4.8452296592555302E-2},{"$f":"IF(B3=1,-$M$1,$M$4)","v":-62.222222222222221},{"$f":"MAX(IF(A3=$M$5,$M$8,IF(A3=$M$5/2,$M$2,(E2+D3)*(1+C3))),$M$2)","v":15224.763254519114},{"$f":"$M$10/E3","v":6.5682466340038059E-3},{"$f":"G2+F3","v":1.2794035233893126E-2},{"$f":"G3*E3","v":194.78615750599891},{"$f":"$M$10*A3","v":200},null,null,"max. Gewinn",{"$f":"M8-M2","v":11200}]
[3,{"$f":"IF(A4<$M$11*12/2+1,1,0)","v":1},{"$f":"'Berechnung niedrig Rückgang'!C4","v":3.9284875625936203E-2},{"$f":"IF(B4=1,-$M$1,$M$4)","v":-62.222222222222221},{"$f":"MAX(IF(A4=$M$5,$M$8,IF(A4=$M$5/2,$M$2,(E3+D4)*(1+C4))),$M$2)","v":15758.199570923831},{"$f":"$M$10/E4","v":6.3459026235785547E-3},{"$f":"G3+F4","v":1.913993785747168E-2},{"$f":"G4*E4","v":301.610960533119},{"$f":"$M$10*A4","v":300},null,null,"Gewinn mtl.",{"$f":"M3/(M5/2)","v":62.222222222222221}]
[4,1,{"$f":"'Berechnung niedrig Rückgang'!C5","v":-4.3571723869041332E-2},-62.222222222222221,15012.076557809254,6.6613036254454874E-3,2.5801241482917167E-2,387.33021242807649,400,null,null,"Raten",{"$f":"Uebersicht!E21*12","v":360}]
[5,1,{"$f":"'Berechnung niedrig Rückgang'!C6","v":5.5724263643514391E-2},-62.222222222222221,15782.923960015421,6.3359615907255685E-3,3.2137203073642734E-2,507.21903239887718,500]
[6,1,{"$f":"'Berechnung niedrig Rückgang'!C7","v":2.0198196809336003E-2},-62.222222222222221,16038.231565474018,6.2351013945498206E-3,3.8372304468192557E-2,615.42390476174558,600,null,null,"Dax heute",{"$f":"Uebersicht!E16","v":16000}]
[7,1,{"$f":"'Berechnung niedrig Rückgang'!C8","v":-1.9014428047945772E-2},-62.222222222222221,15672.234663101226,6.3807109930175054E-3,4.4753015461210063E-2,701.37976018948143,700,null,null,"Dax Zukunft",{"$f":"Uebersicht!E23","v":16000}]
[8,1,{"$f":"'Berechnung niedrig Rückgang'!C9","v":3.9214440781289606E-2},-62.222222222222221,16222.150349337046,6.1644108731914648E-3,5.0917426334401529E-2,825.99014539795508,800,null,null,"Rückgang",{"$f":"Uebersicht!E22","v":0.7}]
[9,1,{"$f":"'Berechnung niedrig Rückgang'!C10","v":-5.752864459933274E-2},-62.222222222222221,15230.269365139275,6.5658720540354371E-3,5.7483298388436965E-2,875.4861184525713,900,null,null,"Beitrag",{"$f":"Hilfe!G3","v":100}]
[10,1,{"$f":"'Berechnung niedrig Rückgang'!C11","v":1.3090782152821549E-2},-62.222222222222221,15366.608743748704,6.5076167206171006E-3,6.3990915109054067E-2,983.32335563527124,1000,null,null,"Laufzeit",{"$f":"Uebersicht!E21","v":30}]
[11,1,{"$f":"'Berechnung niedrig Rückgang'!C12","v":-1.2270940083264709E-2},-62.222222222222221,15116.587311509706,6.6152497213349485E-3,7.060616483038902E-2,1067.3242553894215,1100]
[12,1,{"$f":"'Berechnung niedrig Rückgang'!C13","v":-1.0792798161679329E-2},-62.222222222222221,14891.886365426572,6.7150660128701264E-3,7.7321230843259148E-2,1151.4589833527314,1200]
[13,1,{"$f":"'Berechnung niedrig Rückgang'!C14","v":-2.9402740155339641E-2},-62.222222222222221,14393.631381810754,6.9475170891461135E-3,8.4268747932405255E-2,1212.9332947457683,1300,null,null,{"$f":"\"Ablauf in \"&FIXED(Uebersicht!E21,0)&\" Jahren\"","v":"Ablauf in 30 Jahren"},null,null,{"$f":"VLOOKUP(M5,A:I,8)","v":69124.857834758048}]
[14,1,{"$f":"'Berechnung niedrig Rückgang'!C15","v":-6.6261244977439404E-3},-62.222222222222221,14236.447458268991,7.0242242872126607E-3,9.1292972219617921E-2,1299.6876023138011,1400,null,null,{"$f":"\"Beitragsumme über \"&FIXED(Uebersicht!E21,0)&\" Jahren\"","v":"Beitragsumme über 30 Jahren"},null,null,{"$f":"VLOOKUP(Uebersicht!E21*12,Berechnung!A1:I601,9)","v":36000}]
[15,1,{"$f":"'Berechnung niedrig Rückgang'!C16","v":3.0662416030842451E-2},-62.222222222222221,10237.0005,9.7684863842685161E-3,0.10106145860388643,1034.5662022587148,1500,null,null,"Rendite p.a.",null,null,{"$f":"RATE(M5,-M10,0,O14,0,1%)*12","v":3.9773044319072109E-2}]
[16,1,{"$f":"'Berechnung niedrig Rückgang'!C17","v":1.7938671937786151E-2},-62.222222222222221,10357.300287342545,9.6550256558852552E-3,0.11071648425977169,1146.7238742372897,1600]
[17,1,{"$f":"'Berechnung niedrig Rückgang'!C18","v":-1.1046045355368642E-2},-62.222222222222221,10181.358165875941,9.8218723249676211E-3,0.12053835658473931,1227.2441811153017,1700]
[18,1,{"$f":"'Berechnung niedrig Rückgang'!C19","v":4.0589334434468716E-2},-62.222222222222221,10529.864936658532,9.4967979742894247E-3,0.13003515455902873,1369.2526145240895,1800]
[19,1,{"$f":"'Berechnung niedrig Rückgang'!C20","v":4.501659656482359E-2},-62.222222222222221,10938.860363496802,9.1417201314409335E-3,0.13917687469046966,1522.4363980669398,1900]
{"$rows_left_out":582}
{"sheet":"Berechnung niedrig","index":4,"n_rows":601,"n_cols":15,"rows_kept":601,"cut":false,"hidden":true,"merged":[[13,11,13,13],[14,11,14,13],[15,11,15,13]]}
["Monate","Verlust?","Volatilität","Verlust / Gewinn","Kurs","neue Anteile","Gesamtanteile","Anteilguthaben","Beitrag",null,null,"Verlust mtl.",{"$f":"(Uebersicht!E16-'Berechnung niedrig'!M2)/(M5/2)","v":62.222222222222221}]
[1,{"$f":"IF(A2<M11*12/2+1,1,0)","v":1},{"$f":"'Berechnung niedrig Rückgang'!C2","v":2.7316374330955136E-2},{"$f":"IF(B2=1,-$M$1,$M$4)","v":-62.222222222222221},{"$f":"MAX(M7-D2,M2)","v":16062.222222222223},{"$f":"$M$10/E2","v":6.2257885998893191E-3},{"$f":"F2","v":6.2257885998893191E-3},{"$f":"G2*E2","v":100},{"$f":"$M$10*A2","v":100},null,null,"Minimalwert",{"$f":"M7*(1-M9)","v":4800.0000000000009}]
[2,{"$f":"IF(A3<$M$11*12/2+1,1,0)","v":1},{"$f":"'Berechnung niedrig Rückgang'!C3","v":-4.8452296592555302E-2},{"$f":"IF(B3=1,-$M$1,$M$4)","v":-62.222222222222221},{"$f":"MAX(IF(A3=$M$5,$M$8,IF(A3=$M$5/2,$M$2,(E2+D3)*(1+C3))),$M$2)","v":15224.763254519114},{"$f":"$M$10/E3","v":6.5682466340038059E-3},{"$f":"G2+F3","v":1.2794035233893126E-2},{"$f":"G3*E3","v":194.78615750599891},{"$f":"$M$10*A3","v":200},null,null,"max. Gewinn",{"$f":"M8-M2","v":7999.9999999999991}]
[3,{"$f":"IF(A4<$M$11*12/2+1,1,0)","v":1},{"$f":"'Berechnung niedrig Rückgang'!C4","v":3.9284875625936203E-2},{"$f":"IF(B4=1,-$M$1,$M$4)","v":-62.222222222222221},{"$f":"MAX(IF(A4=$M$5,$M$8,IF(A4=$M$5/2,$M$2,(E3+D4)*(1+C4))),$M$2)","v":15758.199570923831},{"$f":"$M$10/E4","v":6.3459026235785547E-3},{"$f":"G3+F4","v":1.913993785747168E-2},301.610960533119,{"$f":"$M$10*A4","v":300},null,null,"Gewinn mtl.",{"$f":"M3/(M5/2)","v":44.444444444444443}]
[4,1,{"$f":"'Berechnung niedrig Rückgang'!C5","v":-4.3571723869041332E-2},-62.222222222222221,15012.076557809254,6.6613036254454874E-3,2.5801241482917167E-2,387.33021242807649,400,null,null,"Raten",{"$f":"Uebersicht!E21*12","v":360}]
[5,1,{"$f":"'Berechnung niedrig Rückgang'!C6","v":5.5724263643514391E-2},-62.222222222222221,15782.923960015421,6.3359615907255685E-3,3.2137203073642734E-2,507.21903239887718,500]
[6,1,{"$f":"'Berechnung niedrig Rückgang'!C7","v":2.0198196809336003E-2},-62.222222222222221,16038.231565474018,6.2351013945498206E-3,3.8372304468192557E-2,615.42390476174558,600,null,null,"Dax heute",{"$f":"Uebersicht!E16","v":16000}]
[7,1,{"$f":"'Berechnung niedrig Rückgang'!C8","v":-1.9014428047945772E-2},-62.222222222222221,15672.234663101226,6.3807109930175054E-3,4.4753015461210063E-2,701.37976018948143,700,null,null,"Dax Zukunft",{"$f":"Uebersicht!E23*0.8","v":12800}]
[8,1,{"$f":"'Berechnung niedrig Rückgang'!C9","v":3.9214440781289606E-2},-62.222222222222221,16222.150349337046,6.1644108731914648E-3,5.0917426334401529E-2,825.99014539795508,800,null,null,"Rückgang",{"$f":"Uebersicht!E22","v":0.7}]
[9,1,{"$f":"'Berechnung niedrig Rückgang'!C10","v":-5.752864459933274E-2},-62.222222222222221,15230.269365139275,6.5658720540354371E-3,5.7483298388436965E-2,875.4861184525713,900,null,null,"Beitrag",{"$f":"Hilfe!G3","v":100}]
[10,1,{"$f":"'Berechnung niedrig Rückgang'!C11","v":1.3090782152821549E-2},-62.222222222222221,15366.608743748704,6.5076167206171006E-3,6.3990915109054067E-2,983.32335563527124,1000,null,null,"Laufzeit",{"$f":"Uebersicht!E21","v":30}]
[11,1,{"$f":"'Berechnung niedrig Rückgang'!C12","v":-1.2270940083264709E-2},-62.222222222222221,15116.587311509706,6.6152497213349485E-3,7.060616483038902E-2,1067.3242553894215,1100]
[12,1,{"$f":"'Berechnung niedrig Rückgang'!C13","v":-1.0792798161679329E-2},-62.222222222222221,14891.886365426572,6.7150660128701264E-3,7.7321230843259148E-2,1151.4589833527314,1200]
[13,1,{"$f":"'Berechnung niedrig Rückgang'!C14","v":-2.9402740155339641E-2},-62.222222222222221,14393.631381810754,6.9475170891461135E-3,8.4268747932405255E-2,1212.9332947457683,1300,null,null,{"$f":"\"Ablauf in \"&FIXED(Uebersicht!E21,0)&\" Jahren\"","v":"Ablauf in 30 Jahren"},null,null,{"$f":"VLOOKUP(M5,A:I,8)","v":45333.031161364212}]
[14,1,{"$f":"'Berechnung niedrig Rückgang'!C15","v":-6.6261244977439404E-3},-62.222222222222221,14236.447458268991,7.0242242872126607E-3,9.1292972219617921E-2,1299.6876023138011,1400,null,null,{"$f":"\"Beitragsumme über \"&FIXED(Uebersicht!E21,0)&\" Jahren\"","v":"Beitragsumme über 30 Jahren"},null,null,{"$f":"VLOOKUP(Uebersicht!E21*12,Berechnung!A1:I601,9)","v":36000}]
[15,1,{"$f":"'Berechnung niedrig Rückgang'!C16","v":3.0662416030842451E-2},-62.222222222222221,14608.8412271493,6.8451698834373275E-3,9.8138142103055243E-2,1433.6845363109499,1500,null,null,"Rendite p.a.",null,null,{"$f":"RATE(M5,-M10,0,O14,0,1%)*12","v":1.4867282999341123E-2}]
[16,1,{"$f":"'Berechnung niedrig Rückgang'!C17","v":1.7938671937786151E-2},-62.222222222222221,14807.566031060429,6.7533043438901081E-3,0.10489144644694536,1553.1870193565821,1600]
[17,1,{"$f":"'Berechnung niedrig Rückgang'!C18","v":-1.1046045355368642E-2},-62.222222222222221,14582.466072345274,6.8575506710517008E-3,0.11174899711799706,1629.5759590918019,1700]
[18,1,{"$f":"'Berechnung niedrig Rückgang'!C19","v":4.0589334434468716E-2},-62.222222222222221,15109.610883825735,6.6183041223812191E-3,0.11836730124037828,1788.4838631106991,1800]
[19,1,{"$f":"'Berechnung niedrig Rückgang'!C20","v":4.501659656482359E-2},-62.222222222222221,15724.770886337017,6.3593931334725061E-3,0.12472669437385078,1961.2986924389838,1900]
{"$rows_left_out":581}